BDBM50088049 CHEMBL3427124
SMILES: CCCCCCCCCCCCCCCC(=O)C1=C(O)C(COS(C)(=O)=O)OC1=O
InChI Key: InChIKey=JEBZNTXSZSEATC-UHFFFAOYSA-N
Data: 3 IC50
Activity Spreadsheet -- Enzyme Inhibition Constant Data from BindingDB
Found 3 hits for monomerid = 50088049
Trg + Lig
Ki
nM
ΔG°
kcal/mole
IC50
nM
Kd
nM
EC50/IC50
nM
koff
s-1
kon
M-1s-1
pHTemp
°C
Protein-tyrosine phosphatase 1B
(Homo sapiens (Human))
BDBM50088049
(CHEMBL3427124)
Show SMILES CCCCCCCCCCCCCCCC(=O)C1=C(O)C(COS(C)(=O)=O)OC1=O |c:17|
Show InChI InChI=1S/C22H38O7S/c1-3-4-5-6-7-8-9-10-11-12-13-14-15-16-18(23)20-21(24)19(29-22(20)25)17-28-30(2,26)27/h19,24H,3-17H2,1-2H3
NCI pathway
Reactome pathway
n/an/a 400n/an/an/an/an/an/a
University of Campinas
Curated by ChEMBL
Assay Description
Inhibition of 6-His-N-terminal tagged human PTP1B expressed in Escherichia coli BL21 (DE3) cells assessed as pNP formation using pNPP as substrate in...
Eur J Med Chem 97: 42-54 (2015)
Article DOI: 10.1016/j.ejmech.2015.04.036
BindingDB Entry DOI: 10.7270/Q2TF002F
Low molecular weight phosphotyrosine protein phosphatase
(Homo sapiens (Human))
BDBM50088049
(CHEMBL3427124)
Show SMILES CCCCCCCCCCCCCCCC(=O)C1=C(O)C(COS(C)(=O)=O)OC1=O |c:17|
Show InChI InChI=1S/C22H38O7S/c1-3-4-5-6-7-8-9-10-11-12-13-14-15-16-18(23)20-21(24)19(29-22(20)25)17-28-30(2,26)27/h19,24H,3-17H2,1-2H3
n/an/a 3.30E+3n/an/an/an/an/an/a
University of Campinas
Curated by ChEMBL
Assay Description
Inhibition of full length 6-His-N-terminal tagged human LMW-PTP expressed in Escherichia coli BL21 (DE3) cells assessed as pNP formation using pNPP a...
Eur J Med Chem 97: 42-54 (2015)
Article DOI: 10.1016/j.ejmech.2015.04.036
BindingDB Entry DOI: 10.7270/Q2TF002F
Dual specificity phosphatase Cdc25B
(Homo sapiens (Human))
BDBM50088049
(CHEMBL3427124)
Show SMILES CCCCCCCCCCCCCCCC(=O)C1=C(O)C(COS(C)(=O)=O)OC1=O |c:17|
Show InChI InChI=1S/C22H38O7S/c1-3-4-5-6-7-8-9-10-11-12-13-14-15-16-18(23)20-21(24)19(29-22(20)25)17-28-30(2,26)27/h19,24H,3-17H2,1-2H3
Reactome pathway
n/an/a 8.00E+3n/an/an/an/an/an/a
University of Campinas
Curated by ChEMBL
Assay Description
Inhibition of 6-His-N-terminal tagged human CDC-25B isoform 3 catalytic domain expressed in Escherichia coli BL21 (DE3) cells assessed as pNP formati...
Eur J Med Chem 97: 42-54 (2015)
Article DOI: 10.1016/j.ejmech.2015.04.036
BindingDB Entry DOI: 10.7270/Q2TF002F