null
SMILES: O=C(CN(C1CCCCC1)C(=O)Cn1nnc(n1)-c1ccc2OCOc2c1)NC1CCCC1
InChI Key: InChIKey=GDOCPHWHVZLBBD-UHFFFAOYSA-N
Activity Spreadsheet -- Enzyme Inhibition Constant Data from BindingDB
Found 1 hit for monomerid = 50088195
Trg + Lig
Ki
nM
ΔG°
kcal/mole
IC50
nM
Kd
nM
EC50/IC50
nM
koff
s-1
kon
M-1s-1
pHTemp
°C
Scavenger receptor class B member 1
(Mus musculus)
BDBM50088195
(CHEMBL3427497)
Show SMILES O=C(CN(C1CCCCC1)C(=O)Cn1nnc(n1)-c1ccc2OCOc2c1)NC1CCCC1
Show InChI InChI=1S/C23H30N6O4/c30-21(24-17-6-4-5-7-17)13-28(18-8-2-1-3-9-18)22(31)14-29-26-23(25-27-29)16-10-11-19-20(12-16)33-15-32-19/h10-12,17-18H,1-9,13-15H2,(H,24,30)
n/an/a 26n/an/an/an/an/an/a
Marquette University
Curated by ChEMBL
Assay Description
Inhibition of mouse SR-BI isoform 1 expressed in CHO cells assessed as reduction in transfer of fluorescent lipid DiI from human HDL particles into c...
Bioorg Med Chem Lett 25: 2594-8 (2015)
Article DOI: 10.1016/j.bmcl.2015.03.074
BindingDB Entry DOI: 10.7270/Q25Q4XTV