BDBM50088222 (2S,4R)-2-Amino-4-((E)-3-naphthalen-2-yl-allyl)-pentanedioic acid::CHEMBL301536::E-2-Amino-4-(3-naphthalen-2-yl-allyl)-pentanedioic acid(LY339434)::LY-339434
SMILES: N[C@@H](C[C@@H](C\C=C\c1ccc2ccccc2c1)C(O)=O)C(O)=O
InChI Key: InChIKey=KNAYYBRIBNEIAL-WNEUIUNWSA-N
Data: 16 KI  8 EC50
Activity Spreadsheet -- Enzyme Inhibition Constant Data from BindingDB
Found 24 hits for monomerid = 50088222
Trg + Lig
Ki
nM
ΔG°
kcal/mole
IC50
nM
Kd
nM
EC50/IC50
nM
koff
s-1
kon
M-1s-1
pHTemp
°C
GRIK1
(Homo sapiens (Human))
BDBM50088222
((2S,4R)-2-Amino-4-((E)-3-naphthalen-2-yl-allyl)-pe...)
Show SMILES N[C@@H](C[C@@H](C\C=C\c1ccc2ccccc2c1)C(O)=O)C(O)=O
Show InChI InChI=1S/C18H19NO4/c19-16(18(22)23)11-15(17(20)21)7-3-4-12-8-9-13-5-1-2-6-14(13)10-12/h1-6,8-10,15-16H,7,11,19H2,(H,20,21)(H,22,23)/b4-3+/t15-,16+/m1/s1
14n/an/an/an/an/an/an/an/a
Lilly, S.A.
Curated by ChEMBL
Assay Description
Compound was tested for binding affinity against Ionotropic glutamate receptor ionotropic kainate 1 in HK293 cells using [3H]-kainate as radioligand;...
J Med Chem 43: 1958-68 (2000)
BindingDB Entry DOI: 10.7270/Q2FX78QB
GRIK1
(Homo sapiens (Human))
BDBM50088222
((2S,4R)-2-Amino-4-((E)-3-naphthalen-2-yl-allyl)-pe...)
Show SMILES N[C@@H](C[C@@H](C\C=C\c1ccc2ccccc2c1)C(O)=O)C(O)=O
Show InChI InChI=1S/C18H19NO4/c19-16(18(22)23)11-15(17(20)21)7-3-4-12-8-9-13-5-1-2-6-14(13)10-12/h1-6,8-10,15-16H,7,11,19H2,(H,20,21)(H,22,23)/b4-3+/t15-,16+/m1/s1
15n/an/an/an/an/an/an/an/a
Eli Lilly and Company Ltd
Curated by ChEMBL
Assay Description
Binding affinity of compound was determined against Ionotropic glutamate receptor ionotropic kainate 1 using cell membranes prepared from HEK293 cell...
Bioorg Med Chem Lett 10: 1807-10 (2000)
BindingDB Entry DOI: 10.7270/Q2765FVB
GRIK1
(Homo sapiens (Human))
BDBM50088222
((2S,4R)-2-Amino-4-((E)-3-naphthalen-2-yl-allyl)-pe...)
Show SMILES N[C@@H](C[C@@H](C\C=C\c1ccc2ccccc2c1)C(O)=O)C(O)=O
Show InChI InChI=1S/C18H19NO4/c19-16(18(22)23)11-15(17(20)21)7-3-4-12-8-9-13-5-1-2-6-14(13)10-12/h1-6,8-10,15-16H,7,11,19H2,(H,20,21)(H,22,23)/b4-3+/t15-,16+/m1/s1
15n/an/an/an/an/an/an/an/a
Lilly, S.A.
Curated by ChEMBL
Assay Description
Compound was tested for binding affinity against Ionotropic glutamate receptor ionotropic kainate 1 in HK293 cells using [3H]-kainate as radioligand;...
J Med Chem 43: 1958-68 (2000)
BindingDB Entry DOI: 10.7270/Q2FX78QB
Glutamate-Kainate 7
(Homo sapiens (Human))
BDBM50088222
((2S,4R)-2-Amino-4-((E)-3-naphthalen-2-yl-allyl)-pe...)
Show SMILES N[C@@H](C[C@@H](C\C=C\c1ccc2ccccc2c1)C(O)=O)C(O)=O
Show InChI InChI=1S/C18H19NO4/c19-16(18(22)23)11-15(17(20)21)7-3-4-12-8-9-13-5-1-2-6-14(13)10-12/h1-6,8-10,15-16H,7,11,19H2,(H,20,21)(H,22,23)/b4-3+/t15-,16+/m1/s1
Reactome pathway
617n/an/an/an/an/an/an/an/a
Lilly, S.A.
Curated by ChEMBL
Assay Description
Ability of the compound to bind to Ionotropic glutamate receptor ionotropic kainate 3 was evaluated
J Med Chem 43: 1958-68 (2000)
BindingDB Entry DOI: 10.7270/Q2FX78QB
Glutamate-Kainate 7
(Homo sapiens (Human))
BDBM50088222
((2S,4R)-2-Amino-4-((E)-3-naphthalen-2-yl-allyl)-pe...)
Show SMILES N[C@@H](C[C@@H](C\C=C\c1ccc2ccccc2c1)C(O)=O)C(O)=O
Show InChI InChI=1S/C18H19NO4/c19-16(18(22)23)11-15(17(20)21)7-3-4-12-8-9-13-5-1-2-6-14(13)10-12/h1-6,8-10,15-16H,7,11,19H2,(H,20,21)(H,22,23)/b4-3+/t15-,16+/m1/s1
Reactome pathway
617n/an/an/an/an/an/an/an/a
Eli Lilly and Company Ltd
Curated by ChEMBL
Assay Description
Binding affinity of compound was determined against Ionotropic glutamate receptor ionotropic kainate 3 using cell membranes prepared from HEK293 cell...
Bioorg Med Chem Lett 10: 1807-10 (2000)
BindingDB Entry DOI: 10.7270/Q2765FVB
Glutamate receptor ionotropic, kainate 2
(Homo sapiens (Human))
BDBM50088222
((2S,4R)-2-Amino-4-((E)-3-naphthalen-2-yl-allyl)-pe...)
Show SMILES N[C@@H](C[C@@H](C\C=C\c1ccc2ccccc2c1)C(O)=O)C(O)=O
Show InChI InChI=1S/C18H19NO4/c19-16(18(22)23)11-15(17(20)21)7-3-4-12-8-9-13-5-1-2-6-14(13)10-12/h1-6,8-10,15-16H,7,11,19H2,(H,20,21)(H,22,23)/b4-3+/t15-,16+/m1/s1
>1.00E+4n/an/an/an/an/an/an/an/a
Lilly, S.A.
Curated by ChEMBL
Assay Description
Compound was tested for binding affinity against human Ionotropic glutamate receptor ionotropic kainate 2 in HK293 cells using [3H]-AMPA as radioliga...
J Med Chem 43: 1958-68 (2000)
BindingDB Entry DOI: 10.7270/Q2FX78QB
Grik5
(Homo sapiens (Human))
BDBM50088222
((2S,4R)-2-Amino-4-((E)-3-naphthalen-2-yl-allyl)-pe...)
Show SMILES N[C@@H](C[C@@H](C\C=C\c1ccc2ccccc2c1)C(O)=O)C(O)=O
Show InChI InChI=1S/C18H19NO4/c19-16(18(22)23)11-15(17(20)21)7-3-4-12-8-9-13-5-1-2-6-14(13)10-12/h1-6,8-10,15-16H,7,11,19H2,(H,20,21)(H,22,23)/b4-3+/t15-,16+/m1/s1
>1.00E+4n/an/an/an/an/an/an/an/a
Eli Lilly and Company Ltd
Curated by ChEMBL
Assay Description
Binding affinity of compound was determined against Glutamate receptor (KA2) using cell membranes prepared from HEK293 cells
Bioorg Med Chem Lett 10: 1807-10 (2000)
BindingDB Entry DOI: 10.7270/Q2765FVB
Glutamate receptor ionotropic AMPA
(Homo sapiens (Human))
BDBM50088222
((2S,4R)-2-Amino-4-((E)-3-naphthalen-2-yl-allyl)-pe...)
Show SMILES N[C@@H](C[C@@H](C\C=C\c1ccc2ccccc2c1)C(O)=O)C(O)=O
Show InChI InChI=1S/C18H19NO4/c19-16(18(22)23)11-15(17(20)21)7-3-4-12-8-9-13-5-1-2-6-14(13)10-12/h1-6,8-10,15-16H,7,11,19H2,(H,20,21)(H,22,23)/b4-3+/t15-,16+/m1/s1
Reactome pathway
>1.00E+4n/an/an/an/an/an/an/an/a
Eli Lilly and Company Ltd
Curated by ChEMBL
Assay Description
Binding affinity of compound was determined against Ionotropic glutamate receptor AMPA 4 using cell membranes prepared from HEK293 cells
Bioorg Med Chem Lett 10: 1807-10 (2000)
BindingDB Entry DOI: 10.7270/Q2765FVB
Grik5
(Homo sapiens (Human))
BDBM50088222
((2S,4R)-2-Amino-4-((E)-3-naphthalen-2-yl-allyl)-pe...)
Show SMILES N[C@@H](C[C@@H](C\C=C\c1ccc2ccccc2c1)C(O)=O)C(O)=O
Show InChI InChI=1S/C18H19NO4/c19-16(18(22)23)11-15(17(20)21)7-3-4-12-8-9-13-5-1-2-6-14(13)10-12/h1-6,8-10,15-16H,7,11,19H2,(H,20,21)(H,22,23)/b4-3+/t15-,16+/m1/s1
>1.00E+4n/an/an/an/an/an/an/an/a
Lilly, S.A.
Curated by ChEMBL
Assay Description
Ability of the compound to bind to Ionotropic glutamate receptor kainate (kainate 2) was evaluated.
J Med Chem 43: 1958-68 (2000)
BindingDB Entry DOI: 10.7270/Q2FX78QB
GRIK1
(Homo sapiens (Human))
BDBM50088222
((2S,4R)-2-Amino-4-((E)-3-naphthalen-2-yl-allyl)-pe...)
Show SMILES N[C@@H](C[C@@H](C\C=C\c1ccc2ccccc2c1)C(O)=O)C(O)=O
Show InChI InChI=1S/C18H19NO4/c19-16(18(22)23)11-15(17(20)21)7-3-4-12-8-9-13-5-1-2-6-14(13)10-12/h1-6,8-10,15-16H,7,11,19H2,(H,20,21)(H,22,23)/b4-3+/t15-,16+/m1/s1
>1.00E+4n/an/an/an/an/an/an/an/a
Lilly, S.A.
Curated by ChEMBL
Assay Description
Binding affinity against human ionotropic glutamate receptor kainate 1 in HK293 cells using [3H]-kainate as radioligand
J Med Chem 43: 1958-68 (2000)
BindingDB Entry DOI: 10.7270/Q2FX78QB
Glutamate receptor ionotropic AMPA
(Homo sapiens (Human))
BDBM50088222
((2S,4R)-2-Amino-4-((E)-3-naphthalen-2-yl-allyl)-pe...)
Show SMILES N[C@@H](C[C@@H](C\C=C\c1ccc2ccccc2c1)C(O)=O)C(O)=O
Show InChI InChI=1S/C18H19NO4/c19-16(18(22)23)11-15(17(20)21)7-3-4-12-8-9-13-5-1-2-6-14(13)10-12/h1-6,8-10,15-16H,7,11,19H2,(H,20,21)(H,22,23)/b4-3+/t15-,16+/m1/s1
Reactome pathway
>1.00E+4n/an/an/an/an/an/an/an/a
Lilly, S.A.
Curated by ChEMBL
Assay Description
Compound was tested for binding affinity against human Ionotropic glutamate receptor AMPA 4 in HEK293 cells using [3H]-AMPA as radioligand
J Med Chem 43: 1958-68 (2000)
BindingDB Entry DOI: 10.7270/Q2FX78QB
GRIA2
(Homo sapiens (Human))
BDBM50088222
((2S,4R)-2-Amino-4-((E)-3-naphthalen-2-yl-allyl)-pe...)
Show SMILES N[C@@H](C[C@@H](C\C=C\c1ccc2ccccc2c1)C(O)=O)C(O)=O
Show InChI InChI=1S/C18H19NO4/c19-16(18(22)23)11-15(17(20)21)7-3-4-12-8-9-13-5-1-2-6-14(13)10-12/h1-6,8-10,15-16H,7,11,19H2,(H,20,21)(H,22,23)/b4-3+/t15-,16+/m1/s1
>1.00E+4n/an/an/an/an/an/an/an/a
Eli Lilly and Company Ltd
Curated by ChEMBL
Assay Description
Binding affinity of compound was determined against Ionotropic glutamate receptor AMPA 2 using cell membranes prepared from HEK293 cells
Bioorg Med Chem Lett 10: 1807-10 (2000)
BindingDB Entry DOI: 10.7270/Q2765FVB
GRIA1
(Homo sapiens (Human))
BDBM50088222
((2S,4R)-2-Amino-4-((E)-3-naphthalen-2-yl-allyl)-pe...)
Show SMILES N[C@@H](C[C@@H](C\C=C\c1ccc2ccccc2c1)C(O)=O)C(O)=O
Show InChI InChI=1S/C18H19NO4/c19-16(18(22)23)11-15(17(20)21)7-3-4-12-8-9-13-5-1-2-6-14(13)10-12/h1-6,8-10,15-16H,7,11,19H2,(H,20,21)(H,22,23)/b4-3+/t15-,16+/m1/s1
>1.00E+4n/an/an/an/an/an/an/an/a
Eli Lilly and Company Ltd
Curated by ChEMBL
Assay Description
Binding affinity of compound was determined against Ionotropic glutamate receptor AMPA 1 using cell membranes prepared from HEK293 cells
Bioorg Med Chem Lett 10: 1807-10 (2000)
BindingDB Entry DOI: 10.7270/Q2765FVB
Glutamate receptor ionotropic, kainate 2
(Homo sapiens (Human))
BDBM50088222
((2S,4R)-2-Amino-4-((E)-3-naphthalen-2-yl-allyl)-pe...)
Show SMILES N[C@@H](C[C@@H](C\C=C\c1ccc2ccccc2c1)C(O)=O)C(O)=O
Show InChI InChI=1S/C18H19NO4/c19-16(18(22)23)11-15(17(20)21)7-3-4-12-8-9-13-5-1-2-6-14(13)10-12/h1-6,8-10,15-16H,7,11,19H2,(H,20,21)(H,22,23)/b4-3+/t15-,16+/m1/s1
1.37E+4n/an/an/an/an/an/an/an/a
Lilly, S.A.
Curated by ChEMBL
Assay Description
Compound was tested for binding affinity against human Ionotropic glutamate receptor ionotropic kainate 2 in HK293 cells using [3H]-kainate as radiol...
J Med Chem 43: 1958-68 (2000)
BindingDB Entry DOI: 10.7270/Q2FX78QB
Glutamate receptor ionotropic, kainate 2
(Homo sapiens (Human))
BDBM50088222
((2S,4R)-2-Amino-4-((E)-3-naphthalen-2-yl-allyl)-pe...)
Show SMILES N[C@@H](C[C@@H](C\C=C\c1ccc2ccccc2c1)C(O)=O)C(O)=O
Show InChI InChI=1S/C18H19NO4/c19-16(18(22)23)11-15(17(20)21)7-3-4-12-8-9-13-5-1-2-6-14(13)10-12/h1-6,8-10,15-16H,7,11,19H2,(H,20,21)(H,22,23)/b4-3+/t15-,16+/m1/s1
1.54E+4n/an/an/an/an/an/an/an/a
Lilly, S.A.
Curated by ChEMBL
Assay Description
Compound was tested for binding affinity against human Ionotropic glutamate receptor ionotropic kainate 2 in HK293 cells using [3H]-kainate as radiol...
J Med Chem 43: 1958-68 (2000)
BindingDB Entry DOI: 10.7270/Q2FX78QB
Glutamate receptor ionotropic, kainate 2
(Homo sapiens (Human))
BDBM50088222
((2S,4R)-2-Amino-4-((E)-3-naphthalen-2-yl-allyl)-pe...)
Show SMILES N[C@@H](C[C@@H](C\C=C\c1ccc2ccccc2c1)C(O)=O)C(O)=O
Show InChI InChI=1S/C18H19NO4/c19-16(18(22)23)11-15(17(20)21)7-3-4-12-8-9-13-5-1-2-6-14(13)10-12/h1-6,8-10,15-16H,7,11,19H2,(H,20,21)(H,22,23)/b4-3+/t15-,16+/m1/s1
1.54E+4n/an/an/an/an/an/an/an/a
Eli Lilly and Company Ltd
Curated by ChEMBL
Assay Description
Binding affinity of compound was determined against Ionotropic glutamate receptor ionotropic kainate 2 using cell membranes prepared from HEK293 cell...
Bioorg Med Chem Lett 10: 1807-10 (2000)
BindingDB Entry DOI: 10.7270/Q2765FVB
Glutamate receptor ionotropic, kainate 2
(Homo sapiens (Human))
BDBM50088222
((2S,4R)-2-Amino-4-((E)-3-naphthalen-2-yl-allyl)-pe...)
Show SMILES N[C@@H](C[C@@H](C\C=C\c1ccc2ccccc2c1)C(O)=O)C(O)=O
Show InChI InChI=1S/C18H19NO4/c19-16(18(22)23)11-15(17(20)21)7-3-4-12-8-9-13-5-1-2-6-14(13)10-12/h1-6,8-10,15-16H,7,11,19H2,(H,20,21)(H,22,23)/b4-3+/t15-,16+/m1/s1
n/an/an/an/a>1.00E+5n/an/an/an/a
Lilly, S.A.
Curated by ChEMBL
Assay Description
Effective concentration against human GluR6 expressed in HEK293 cells
J Med Chem 43: 1958-68 (2000)
BindingDB Entry DOI: 10.7270/Q2FX78QB
GRIA1
(Homo sapiens (Human))
BDBM50088222
((2S,4R)-2-Amino-4-((E)-3-naphthalen-2-yl-allyl)-pe...)
Show SMILES N[C@@H](C[C@@H](C\C=C\c1ccc2ccccc2c1)C(O)=O)C(O)=O
Show InChI InChI=1S/C18H19NO4/c19-16(18(22)23)11-15(17(20)21)7-3-4-12-8-9-13-5-1-2-6-14(13)10-12/h1-6,8-10,15-16H,7,11,19H2,(H,20,21)(H,22,23)/b4-3+/t15-,16+/m1/s1
n/an/an/an/a>3.00E+5n/an/an/an/a
Pfizer Inc.
Curated by ChEMBL
Assay Description
Agonist activity at GluA1 (unknown origin)
J Med Chem 56: 593-624 (2013)
Article DOI: 10.1021/jm3011433
BindingDB Entry DOI: 10.7270/Q23B61GZ
Glutamate receptor ionotropic, kainate 2
(Homo sapiens (Human))
BDBM50088222
((2S,4R)-2-Amino-4-((E)-3-naphthalen-2-yl-allyl)-pe...)
Show SMILES N[C@@H](C[C@@H](C\C=C\c1ccc2ccccc2c1)C(O)=O)C(O)=O
Show InChI InChI=1S/C18H19NO4/c19-16(18(22)23)11-15(17(20)21)7-3-4-12-8-9-13-5-1-2-6-14(13)10-12/h1-6,8-10,15-16H,7,11,19H2,(H,20,21)(H,22,23)/b4-3+/t15-,16+/m1/s1
n/an/an/an/a>1.00E+5n/an/an/an/a
Pfizer Inc.
Curated by ChEMBL
Assay Description
Agonist activity at GluK2 (unknown origin)
J Med Chem 56: 593-624 (2013)
Article DOI: 10.1021/jm3011433
BindingDB Entry DOI: 10.7270/Q23B61GZ
GRIK1
(Homo sapiens (Human))
BDBM50088222
((2S,4R)-2-Amino-4-((E)-3-naphthalen-2-yl-allyl)-pe...)
Show SMILES N[C@@H](C[C@@H](C\C=C\c1ccc2ccccc2c1)C(O)=O)C(O)=O
Show InChI InChI=1S/C18H19NO4/c19-16(18(22)23)11-15(17(20)21)7-3-4-12-8-9-13-5-1-2-6-14(13)10-12/h1-6,8-10,15-16H,7,11,19H2,(H,20,21)(H,22,23)/b4-3+/t15-,16+/m1/s1
n/an/an/an/a 2.50E+3n/an/an/an/a
Pfizer Inc.
Curated by ChEMBL
Assay Description
Agonist activity at GluK1 (unknown origin)
J Med Chem 56: 593-624 (2013)
Article DOI: 10.1021/jm3011433
BindingDB Entry DOI: 10.7270/Q23B61GZ
Glutamate receptor ionotropic, kainate 1
(RAT)
BDBM50088222
((2S,4R)-2-Amino-4-((E)-3-naphthalen-2-yl-allyl)-pe...)
Show SMILES N[C@@H](C[C@@H](C\C=C\c1ccc2ccccc2c1)C(O)=O)C(O)=O
Show InChI InChI=1S/C18H19NO4/c19-16(18(22)23)11-15(17(20)21)7-3-4-12-8-9-13-5-1-2-6-14(13)10-12/h1-6,8-10,15-16H,7,11,19H2,(H,20,21)(H,22,23)/b4-3+/t15-,16+/m1/s1
n/an/an/an/a 800n/an/an/an/a
Eli Lilly and Company Ltd
Curated by ChEMBL
Assay Description
Compound was tested for agonistic activity on rat dorsal root ganglion neurons (thought to express GluR5 receptors)
Bioorg Med Chem Lett 10: 1807-10 (2000)
BindingDB Entry DOI: 10.7270/Q2765FVB
Glutamate receptor ionotropic kainate
(Homo sapiens (Human))
BDBM50088222
((2S,4R)-2-Amino-4-((E)-3-naphthalen-2-yl-allyl)-pe...)
Show SMILES N[C@@H](C[C@@H](C\C=C\c1ccc2ccccc2c1)C(O)=O)C(O)=O
Show InChI InChI=1S/C18H19NO4/c19-16(18(22)23)11-15(17(20)21)7-3-4-12-8-9-13-5-1-2-6-14(13)10-12/h1-6,8-10,15-16H,7,11,19H2,(H,20,21)(H,22,23)/b4-3+/t15-,16+/m1/s1
n/an/an/an/a 2.50E+3n/an/an/an/a
Eli Lilly and Company Ltd
Curated by ChEMBL
Assay Description
Compound was tested for agonistic activity at Glutamate receptor 6 using HEK293 cells
Bioorg Med Chem Lett 10: 1807-10 (2000)
BindingDB Entry DOI: 10.7270/Q2765FVB
GRIK1
(Homo sapiens (Human))
BDBM50088222
((2S,4R)-2-Amino-4-((E)-3-naphthalen-2-yl-allyl)-pe...)
Show SMILES N[C@@H](C[C@@H](C\C=C\c1ccc2ccccc2c1)C(O)=O)C(O)=O
Show InChI InChI=1S/C18H19NO4/c19-16(18(22)23)11-15(17(20)21)7-3-4-12-8-9-13-5-1-2-6-14(13)10-12/h1-6,8-10,15-16H,7,11,19H2,(H,20,21)(H,22,23)/b4-3+/t15-,16+/m1/s1
n/an/an/an/a 2.50E+3n/an/an/an/a
Lilly, S.A.
Curated by ChEMBL
Assay Description
Effective concentration against GluR5 expressed in HEK293 cells
J Med Chem 43: 1958-68 (2000)
BindingDB Entry DOI: 10.7270/Q2FX78QB
Glutamate receptor ionotropic, kainate 2
(Homo sapiens (Human))
BDBM50088222
((2S,4R)-2-Amino-4-((E)-3-naphthalen-2-yl-allyl)-pe...)
Show SMILES N[C@@H](C[C@@H](C\C=C\c1ccc2ccccc2c1)C(O)=O)C(O)=O
Show InChI InChI=1S/C18H19NO4/c19-16(18(22)23)11-15(17(20)21)7-3-4-12-8-9-13-5-1-2-6-14(13)10-12/h1-6,8-10,15-16H,7,11,19H2,(H,20,21)(H,22,23)/b4-3+/t15-,16+/m1/s1
n/an/an/an/a>1.00E+5n/an/an/an/a
Eli Lilly and Company Ltd
Curated by ChEMBL
Assay Description
Compound was tested for agonistic activity at Glutamate receptor 5 using HEK293 cells
Bioorg Med Chem Lett 10: 1807-10 (2000)
BindingDB Entry DOI: 10.7270/Q2765FVB