BDBM50088296 CHEMBL3427759
SMILES: NC(=O)C1CCCc2c1[nH]nc2-c1cc2ccccc2s1
InChI Key: InChIKey=YBYRXGAVPYXDGX-UHFFFAOYSA-N
Data: 2 IC50
Activity Spreadsheet -- Enzyme Inhibition Constant Data from BindingDB
Found 2 hits for monomerid = 50088296
Trg + Lig
Ki
nM
ΔG°
kcal/mole
IC50
nM
Kd
nM
EC50/IC50
nM
koff
s-1
kon
M-1s-1
pHTemp
°C
NAD-Dependent Deacetylase Sirtuin-1
(Homo sapiens (Human))
BDBM50088296
(CHEMBL3427759)
Show SMILES NC(=O)C1CCCc2c1[nH]nc2-c1cc2ccccc2s1
Show InChI InChI=1S/C16H15N3OS/c17-16(20)11-6-3-5-10-14(11)18-19-15(10)13-8-9-4-1-2-7-12(9)21-13/h1-2,4,7-8,11H,3,5-6H2,(H2,17,20)(H,18,19)
NCI pathway
Reactome pathway
n/an/a 1.70E+3n/an/an/an/an/an/a
MethylGene Inc.
Curated by ChEMBL
Assay Description
Inhibition of His-tagged human recombinant SIRT1 expressed in Escherichia coli using Cbz-Lys(Ac)-AMC as substrate by fluorescence assay
Bioorg Med Chem Lett 25: 2514-8 (2015)
Article DOI: 10.1016/j.bmcl.2015.04.068
BindingDB Entry DOI: 10.7270/Q2X63PN0
NAD-dependent deacetylase sirtuin 2
(Homo sapiens (Human))
BDBM50088296
(CHEMBL3427759)
Show SMILES NC(=O)C1CCCc2c1[nH]nc2-c1cc2ccccc2s1
Show InChI InChI=1S/C16H15N3OS/c17-16(20)11-6-3-5-10-14(11)18-19-15(10)13-8-9-4-1-2-7-12(9)21-13/h1-2,4,7-8,11H,3,5-6H2,(H2,17,20)(H,18,19)
NCI pathway
n/an/a 5.30E+3n/an/an/an/an/an/a
MethylGene Inc.
Curated by ChEMBL
Assay Description
Inhibition of His-tagged human recombinant SIRT2 expressed in Escherichia coli using Cbz-Lys(Ac)-AMC as substrate by fluorescence assay
Bioorg Med Chem Lett 25: 2514-8 (2015)
Article DOI: 10.1016/j.bmcl.2015.04.068
BindingDB Entry DOI: 10.7270/Q2X63PN0