BDBM50088311 CHEMBL61208::Dimethyl-(tetrahydro-thiopyran-4-yl)-{4-[(7-p-tolyl-2,3-dihydro-benzo[b]oxepine-4-carbonyl)-amino]-benzyl}-ammonium; iodide
SMILES: Cc1ccc(cc1)-c1ccc2OCCC(=Cc2c1)C(=O)Nc1ccc(C[N+](C)(C)C2CCSCC2)cc1
InChI Key: InChIKey=NDVWHZJRYRKZQM-UHFFFAOYSA-O
Data: 1 IC50
Activity Spreadsheet -- Enzyme Inhibition Constant Data from BindingDB
Found 1 hit for monomerid = 50088311
Trg + Lig
Ki
nM
ΔG°
kcal/mole
IC50
nM
Kd
nM
EC50/IC50
nM
koff
s-1
kon
M-1s-1
pHTemp
°C
C-C chemokine receptor type 5
(Homo sapiens (Human))
BDBM50088311
(CHEMBL61208 | Dimethyl-(tetrahydro-thiopyran-4-yl)...)
Show SMILES Cc1ccc(cc1)-c1ccc2OCCC(=Cc2c1)C(=O)Nc1ccc(C[N+](C)(C)C2CCSCC2)cc1 |c:15|
Show InChI InChI=1S/C32H36N2O2S/c1-23-4-8-25(9-5-23)26-10-13-31-28(20-26)21-27(14-17-36-31)32(35)33-29-11-6-24(7-12-29)22-34(2,3)30-15-18-37-19-16-30/h4-13,20-21,30H,14-19,22H2,1-3H3/p+1
n/an/a 3.10n/an/an/an/an/an/a
Takeda Chemical Industries, Ltd.
Curated by ChEMBL
Assay Description
Inhibitory effect on Chemokine binding to C-C chemokine receptor type 5 using [125I]-RANTES
J Med Chem 43: 2049-63 (2000)
BindingDB Entry DOI: 10.7270/Q26D5S75