BDBM50088313 1-Methyl-1-(2-{4-[(7-phenyl-3,4-dihydro-naphthalene-2-carbonyl)-amino]-phenyl}-ethyl)-piperidinium; iodide::CHEMBL62611
SMILES: C[N+]1(CCc2ccc(NC(=O)C3=Cc4cc(ccc4CC3)-c3ccccc3)cc2)CCCCC1
InChI Key: InChIKey=GMTMRQWDHOALNH-UHFFFAOYSA-O
Data: 1 IC50
Activity Spreadsheet -- Enzyme Inhibition Constant Data from BindingDB
Found 1 hit for monomerid = 50088313
Trg + Lig
Ki
nM
ΔG°
kcal/mole
IC50
nM
Kd
nM
EC50/IC50
nM
koff
s-1
kon
M-1s-1
pHTemp
°C
C-C chemokine receptor type 5
(Homo sapiens (Human))
BDBM50088313
(1-Methyl-1-(2-{4-[(7-phenyl-3,4-dihydro-naphthalen...)
Show SMILES C[N+]1(CCc2ccc(NC(=O)C3=Cc4cc(ccc4CC3)-c3ccccc3)cc2)CCCCC1 |t:11|
Show InChI InChI=1S/C31H34N2O/c1-33(19-6-3-7-20-33)21-18-24-10-16-30(17-11-24)32-31(34)28-15-13-26-12-14-27(22-29(26)23-28)25-8-4-2-5-9-25/h2,4-5,8-12,14,16-17,22-23H,3,6-7,13,15,18-21H2,1H3/p+1
n/an/a 1.10E+3n/an/an/an/an/an/a
Takeda Chemical Industries, Ltd.
Curated by ChEMBL
Assay Description
Inhibitory effect on Chemokine binding to C-C chemokine receptor type 5 using [125I]-RANTES
J Med Chem 43: 2049-63 (2000)
BindingDB Entry DOI: 10.7270/Q26D5S75