BDBM50088318 1-Methyl-1-{4-[3-(4'-methyl-biphenyl-3-yl)-acryloylamino]-benzyl}-piperidinium; iodide::CHEMBL65696
SMILES: Cc1ccc(cc1)-c1cccc(\C=C\C(=O)Nc2ccc(C[N+]3(C)CCCCC3)cc2)c1
InChI Key: InChIKey=FQEOINRBSWIECI-QGOAFFKASA-O
Data: 1 IC50
Activity Spreadsheet -- Enzyme Inhibition Constant Data from BindingDB
Found 1 hit for monomerid = 50088318
Trg + Lig
Ki
nM
ΔG°
kcal/mole
IC50
nM
Kd
nM
EC50/IC50
nM
koff
s-1
kon
M-1s-1
pHTemp
°C
C-C chemokine receptor type 5
(Homo sapiens (Human))
BDBM50088318
(1-Methyl-1-{4-[3-(4'-methyl-biphenyl-3-yl)-acryloy...)
Show SMILES Cc1ccc(cc1)-c1cccc(\C=C\C(=O)Nc2ccc(C[N+]3(C)CCCCC3)cc2)c1
Show InChI InChI=1S/C29H32N2O/c1-23-9-14-26(15-10-23)27-8-6-7-24(21-27)13-18-29(32)30-28-16-11-25(12-17-28)22-31(2)19-4-3-5-20-31/h6-18,21H,3-5,19-20,22H2,1-2H3/p+1/b18-13+
n/an/a 570n/an/an/an/an/an/a
Takeda Chemical Industries, Ltd.
Curated by ChEMBL
Assay Description
Inhibitory effect on Chemokine binding to C-C chemokine receptor type 5 using [125I]-RANTES
J Med Chem 43: 2049-63 (2000)
BindingDB Entry DOI: 10.7270/Q26D5S75