BDBM50088358 4-Dimethylamino-3,6,12-trihydroxy-6,10-dimethyl-1,11-dioxo-1,4,4a,5,5a,6,11,12a-octahydro-naphthacene-2-carboxylic acid [(2-hydroxy-1,1-bis-hydroxymethyl-ethylamino)-methyl]-amide; hydrochloride::CHEMBL553067::NSC-64205
SMILES: CN(C)[C@H]1[C@@H]2C[C@H]3C(C(=O)C2C(=O)C(C(=O)NCNC(CO)(CO)CO)C1=O)C(=O)c1c(C)cccc1C3(C)O
InChI Key: InChIKey=KXOXEOJMDGSUEO-WKDYOMSMSA-N
Data: 2 IC50
Activity Spreadsheet -- Enzyme Inhibition Constant Data from BindingDB
Found 2 hits for monomerid = 50088358
Trg + Lig
Ki
nM
ΔG°
kcal/mole
IC50
nM
Kd
nM
EC50/IC50
nM
koff
s-1
kon
M-1s-1
pHTemp
°C
Human immunodeficiency virus type 1 integrase
(Human immunodeficiency virus 1)
BDBM50088358
(4-Dimethylamino-3,6,12-trihydroxy-6,10-dimethyl-1,...)
Show SMILES CN(C)[C@H]1[C@@H]2C[C@H]3C(C(=O)C2C(=O)C(C(=O)NCNC(CO)(CO)CO)C1=O)C(=O)c1c(C)cccc1C3(C)O
Show InChI InChI=1S/C28H37N3O9/c1-13-6-5-7-15-17(13)22(35)19-16(27(15,2)40)8-14-18(23(19)36)24(37)20(25(38)21(14)31(3)4)26(39)29-12-30-28(9-32,10-33)11-34/h5-7,14,16,18-21,30,32-34,40H,8-12H2,1-4H3,(H,29,39)/t14-,16+,18?,19?,20?,21+,27?/m1/s1
n/an/a 1.10E+3n/an/an/an/an/an/a
University of California
Curated by ChEMBL
Assay Description
Inhibition of HIV-1 integrase, under 1 uM for the 3''-preprocessing
J Med Chem 43: 2100-14 (2000)
BindingDB Entry DOI: 10.7270/Q27D2VTS
Human immunodeficiency virus type 1 integrase
(Human immunodeficiency virus 1)
BDBM50088358
(4-Dimethylamino-3,6,12-trihydroxy-6,10-dimethyl-1,...)
Show SMILES CN(C)[C@H]1[C@@H]2C[C@H]3C(C(=O)C2C(=O)C(C(=O)NCNC(CO)(CO)CO)C1=O)C(=O)c1c(C)cccc1C3(C)O
Show InChI InChI=1S/C28H37N3O9/c1-13-6-5-7-15-17(13)22(35)19-16(27(15,2)40)8-14-18(23(19)36)24(37)20(25(38)21(14)31(3)4)26(39)29-12-30-28(9-32,10-33)11-34/h5-7,14,16,18-21,30,32-34,40H,8-12H2,1-4H3,(H,29,39)/t14-,16+,18?,19?,20?,21+,27?/m1/s1
n/an/a 500n/an/an/an/an/an/a
University of California
Curated by ChEMBL
Assay Description
Tested for inhibition of HIV-1 integrase, under 1 uM for the strand transfer
J Med Chem 43: 2100-14 (2000)
BindingDB Entry DOI: 10.7270/Q27D2VTS