BDBM50088431 3-(Piperidin-3-yloxy)-pyridine::3-(piperidin-3-yloxy)pyridine::CHEMBL9965
SMILES: C1CNCC(C1)Oc1cccnc1
InChI Key: InChIKey=GHJPZQCAVQYABA-UHFFFAOYSA-N
Data: 2 IC50  1 EC50
Activity Spreadsheet -- Enzyme Inhibition Constant Data from BindingDB
Found 3 hits for monomerid = 50088431
Trg + Lig
Ki
nM
ΔG°
kcal/mole
IC50
nM
Kd
nM
EC50/IC50
nM
koff
s-1
kon
M-1s-1
pHTemp
°C
Neuronal acetylcholine receptor subunit alpha-4
(Homo sapiens (Human))
BDBM50088431
(3-(Piperidin-3-yloxy)-pyridine | 3-(piperidin-3-yl...)
Show SMILES C1CNCC(C1)Oc1cccnc1
Show InChI InChI=1S/C10H14N2O/c1-3-9(7-11-5-1)13-10-4-2-6-12-8-10/h1,3,5,7,10,12H,2,4,6,8H2
n/an/a 191n/an/an/an/an/an/a
University of Turin
Curated by ChEMBL
Assay Description
Displacement of [3H]cytisine from human alpha4beta2 nAChR expressed in HEK293 cells
J Med Chem 52: 2311-6 (2009)
Article DOI: 10.1021/jm801060h
BindingDB Entry DOI: 10.7270/Q2XK8GS0
Neuronal acetylcholine receptor protein alpha-4/beta-2 subunit
(Rattus norvegicus (Rat))
BDBM50088431
(3-(Piperidin-3-yloxy)-pyridine | 3-(piperidin-3-yl...)
Show SMILES C1CNCC(C1)Oc1cccnc1
Show InChI InChI=1S/C10H14N2O/c1-3-9(7-11-5-1)13-10-4-2-6-12-8-10/h1,3,5,7,10,12H,2,4,6,8H2
n/an/a 204n/an/an/an/an/an/a
R.W. Johnson Pharmaceutical Research Institute
Curated by ChEMBL
Assay Description
Evaluated for binding affinity towards nicotinic acetylcholine receptor alpha4-beta2
Bioorg Med Chem Lett 10: 1063-6 (2000)
BindingDB Entry DOI: 10.7270/Q2PK0HBC
Neuronal acetylcholine receptor subunit alpha-4
(Homo sapiens (Human))
BDBM50088431
(3-(Piperidin-3-yloxy)-pyridine | 3-(piperidin-3-yl...)
Show SMILES C1CNCC(C1)Oc1cccnc1
Show InChI InChI=1S/C10H14N2O/c1-3-9(7-11-5-1)13-10-4-2-6-12-8-10/h1,3,5,7,10,12H,2,4,6,8H2
n/an/an/an/a 3.24E+4n/an/an/an/a
University of Turin
Curated by ChEMBL
Assay Description
Agonist activity at human alpha4beta2 nAChR expressed in HEK293 cells assessed as intracellular calcium level by FLIPR assay
J Med Chem 52: 2311-6 (2009)
Article DOI: 10.1021/jm801060h
BindingDB Entry DOI: 10.7270/Q2XK8GS0