BDBM50088451 3-(5-Methoxy-pyridin-3-yl)-9-aza-bicyclo[3.3.1]non-2-ene::3-(5-methoxypyridin-3-yl)-9-azabicyclo[3.3.1]non-2-ene::CHEMBL72605
SMILES: COc1cncc(c1)C1=CC2CCCC(C1)N2
InChI Key: InChIKey=USVAHAACEDZWOK-UHFFFAOYSA-N
Data: 1 IC50  1 EC50
Activity Spreadsheet -- Enzyme Inhibition Constant Data from BindingDB
Found 2 hits for monomerid = 50088451
Trg + Lig
Ki
nM
ΔG°
kcal/mole
IC50
nM
Kd
nM
EC50/IC50
nM
koff
s-1
kon
M-1s-1
pHTemp
°C
Neuronal acetylcholine receptor subunit alpha-4
(Homo sapiens (Human))
BDBM50088451
(3-(5-Methoxy-pyridin-3-yl)-9-aza-bicyclo[3.3.1]non...)
Show SMILES COc1cncc(c1)C1=CC2CCCC(C1)N2 |t:9|
Show InChI InChI=1S/C14H18N2O/c1-17-14-7-11(8-15-9-14)10-5-12-3-2-4-13(6-10)16-12/h5,7-9,12-13,16H,2-4,6H2,1H3
n/an/an/an/a 4.37E+3n/an/an/an/a
University of Turin
Curated by ChEMBL
Assay Description
Agonist activity at human alpha4beta2 nAChR expressed in HEK293 cells assessed as intracellular calcium level by FLIPR assay
J Med Chem 52: 2311-6 (2009)
Article DOI: 10.1021/jm801060h
BindingDB Entry DOI: 10.7270/Q2XK8GS0
Neuronal acetylcholine receptor subunit alpha-4
(Homo sapiens (Human))
BDBM50088451
(3-(5-Methoxy-pyridin-3-yl)-9-aza-bicyclo[3.3.1]non...)
Show SMILES COc1cncc(c1)C1=CC2CCCC(C1)N2 |t:9|
Show InChI InChI=1S/C14H18N2O/c1-17-14-7-11(8-15-9-14)10-5-12-3-2-4-13(6-10)16-12/h5,7-9,12-13,16H,2-4,6H2,1H3
n/an/a 3.02n/an/an/an/an/an/a
University of Turin
Curated by ChEMBL
Assay Description
Displacement of [3H]cytisine from human alpha4beta2 nAChR expressed in HEK293 cells
J Med Chem 52: 2311-6 (2009)
Article DOI: 10.1021/jm801060h
BindingDB Entry DOI: 10.7270/Q2XK8GS0