BDBM50088581 CHEMBL3577345
SMILES: CCCCn1cc(CCCOc2ccc(cc2OC)C(=O)NCCCCN(CCC)[C@@H]2CCc3c(O)cccc3C2)nn1
InChI Key: InChIKey=OVKBSFKFSBQCLW-GDLZYMKVSA-N
Data: 6 KI  3 EC50
Activity Spreadsheet -- Enzyme Inhibition Constant Data from BindingDB
Found 9 hits for monomerid = 50088581
Trg + Lig
Ki
nM
ΔG°
kcal/mole
IC50
nM
Kd
nM
EC50/IC50
nM
koff
s-1
kon
M-1s-1
pHTemp
°C
D(3) dopamine receptor
(Homo sapiens (Human))
BDBM50088581
(CHEMBL3577345)
Show SMILES CCCCn1cc(CCCOc2ccc(cc2OC)C(=O)NCCCCN(CCC)[C@@H]2CCc3c(O)cccc3C2)nn1 |r|
Show InChI InChI=1S/C34H49N5O4/c1-4-6-21-39-25-28(36-37-39)12-10-22-43-32-17-14-27(24-33(32)42-3)34(41)35-18-7-8-20-38(19-5-2)29-15-16-30-26(23-29)11-9-13-31(30)40/h9,11,13-14,17,24-25,29,40H,4-8,10,12,15-16,18-23H2,1-3H3,(H,35,41)/t29-/m1/s1
1.20n/an/an/an/an/an/an/an/a
Friedrich Alexander University
Curated by ChEMBL
Assay Description
Displacement of [3H]spiperone from human dopamine D3 receptor transfected in CHO cells after 1 hr by scintillation counting analysis
J Med Chem 58: 2703-17 (2015)
Article DOI: 10.1021/jm501889t
BindingDB Entry DOI: 10.7270/Q2R49SHG
D(2) dopamine receptor
(Homo sapiens (Human))
BDBM50088581
(CHEMBL3577345)
Show SMILES CCCCn1cc(CCCOc2ccc(cc2OC)C(=O)NCCCCN(CCC)[C@@H]2CCc3c(O)cccc3C2)nn1 |r|
Show InChI InChI=1S/C34H49N5O4/c1-4-6-21-39-25-28(36-37-39)12-10-22-43-32-17-14-27(24-33(32)42-3)34(41)35-18-7-8-20-38(19-5-2)29-15-16-30-26(23-29)11-9-13-31(30)40/h9,11,13-14,17,24-25,29,40H,4-8,10,12,15-16,18-23H2,1-3H3,(H,35,41)/t29-/m1/s1
Reactome pathway
18n/an/an/an/an/an/an/an/a
Friedrich Alexander University
Curated by ChEMBL
Assay Description
Displacement of [3H]spiperone from human dopamine D2L receptor transfected in CHO cells after 1 hr by scintillation counting analysis
J Med Chem 58: 2703-17 (2015)
Article DOI: 10.1021/jm501889t
BindingDB Entry DOI: 10.7270/Q2R49SHG
D(2) dopamine receptor
(Homo sapiens (Human))
BDBM50088581
(CHEMBL3577345)
Show SMILES CCCCn1cc(CCCOc2ccc(cc2OC)C(=O)NCCCCN(CCC)[C@@H]2CCc3c(O)cccc3C2)nn1 |r|
Show InChI InChI=1S/C34H49N5O4/c1-4-6-21-39-25-28(36-37-39)12-10-22-43-32-17-14-27(24-33(32)42-3)34(41)35-18-7-8-20-38(19-5-2)29-15-16-30-26(23-29)11-9-13-31(30)40/h9,11,13-14,17,24-25,29,40H,4-8,10,12,15-16,18-23H2,1-3H3,(H,35,41)/t29-/m1/s1
Reactome pathway
30n/an/an/an/an/an/an/an/a
Friedrich Alexander University
Curated by ChEMBL
Assay Description
Displacement of [3H]spiperone from human dopamine D2S receptor transfected in CHO cells after 1 hr by scintillation counting analysis
J Med Chem 58: 2703-17 (2015)
Article DOI: 10.1021/jm501889t
BindingDB Entry DOI: 10.7270/Q2R49SHG
5-hydroxytryptamine receptor 2A
(Homo sapiens (Human))
BDBM50088581
(CHEMBL3577345)
Show SMILES CCCCn1cc(CCCOc2ccc(cc2OC)C(=O)NCCCCN(CCC)[C@@H]2CCc3c(O)cccc3C2)nn1 |r|
Show InChI InChI=1S/C34H49N5O4/c1-4-6-21-39-25-28(36-37-39)12-10-22-43-32-17-14-27(24-33(32)42-3)34(41)35-18-7-8-20-38(19-5-2)29-15-16-30-26(23-29)11-9-13-31(30)40/h9,11,13-14,17,24-25,29,40H,4-8,10,12,15-16,18-23H2,1-3H3,(H,35,41)/t29-/m1/s1
Reactome pathway
1.00E+3n/an/an/an/an/an/an/an/a
Friedrich Alexander University
Curated by ChEMBL
Assay Description
Displacement of [3H]ketanserin from human 5-HT2A receptor transfected in HEK293 cells by scintillation counting analysis
J Med Chem 58: 2703-17 (2015)
Article DOI: 10.1021/jm501889t
BindingDB Entry DOI: 10.7270/Q2R49SHG
D(1B) dopamine receptor
(Homo sapiens (Human))
BDBM50088581
(CHEMBL3577345)
Show SMILES CCCCn1cc(CCCOc2ccc(cc2OC)C(=O)NCCCCN(CCC)[C@@H]2CCc3c(O)cccc3C2)nn1 |r|
Show InChI InChI=1S/C34H49N5O4/c1-4-6-21-39-25-28(36-37-39)12-10-22-43-32-17-14-27(24-33(32)42-3)34(41)35-18-7-8-20-38(19-5-2)29-15-16-30-26(23-29)11-9-13-31(30)40/h9,11,13-14,17,24-25,29,40H,4-8,10,12,15-16,18-23H2,1-3H3,(H,35,41)/t29-/m1/s1
2.10E+4n/an/an/an/an/an/an/an/a
Friedrich Alexander University
Curated by ChEMBL
Assay Description
Displacement of [3H]SCH23390 from human dopamine D5 receptor transfected in HEK293 cells after 1 hr by scintillation counting analysis
J Med Chem 58: 2703-17 (2015)
Article DOI: 10.1021/jm501889t
BindingDB Entry DOI: 10.7270/Q2R49SHG
D(1A) dopamine receptor
(Homo sapiens (Human))
BDBM50088581
(CHEMBL3577345)
Show SMILES CCCCn1cc(CCCOc2ccc(cc2OC)C(=O)NCCCCN(CCC)[C@@H]2CCc3c(O)cccc3C2)nn1 |r|
Show InChI InChI=1S/C34H49N5O4/c1-4-6-21-39-25-28(36-37-39)12-10-22-43-32-17-14-27(24-33(32)42-3)34(41)35-18-7-8-20-38(19-5-2)29-15-16-30-26(23-29)11-9-13-31(30)40/h9,11,13-14,17,24-25,29,40H,4-8,10,12,15-16,18-23H2,1-3H3,(H,35,41)/t29-/m1/s1
2.30E+4n/an/an/an/an/an/an/an/a
Friedrich Alexander University
Curated by ChEMBL
Assay Description
Displacement of [3H]SCH23390 from human dopamine D1 receptor transfected in HEK293 cells after 1 hr by scintillation counting analysis
J Med Chem 58: 2703-17 (2015)
Article DOI: 10.1021/jm501889t
BindingDB Entry DOI: 10.7270/Q2R49SHG
D(2) dopamine receptor
(Homo sapiens (Human))
BDBM50088581
(CHEMBL3577345)
Show SMILES CCCCn1cc(CCCOc2ccc(cc2OC)C(=O)NCCCCN(CCC)[C@@H]2CCc3c(O)cccc3C2)nn1 |r|
Show InChI InChI=1S/C34H49N5O4/c1-4-6-21-39-25-28(36-37-39)12-10-22-43-32-17-14-27(24-33(32)42-3)34(41)35-18-7-8-20-38(19-5-2)29-15-16-30-26(23-29)11-9-13-31(30)40/h9,11,13-14,17,24-25,29,40H,4-8,10,12,15-16,18-23H2,1-3H3,(H,35,41)/t29-/m1/s1
Reactome pathway
n/an/an/an/a 30n/an/an/an/a
Friedrich Alexander University
Curated by ChEMBL
Assay Description
Agonist activity at ARMS2-PK2-tagged human dopamine D2S receptor expressed in HEK293 cells co-expressing (EA)-tagged beta arrestin fusion protein ass...
J Med Chem 58: 2703-17 (2015)
Article DOI: 10.1021/jm501889t
BindingDB Entry DOI: 10.7270/Q2R49SHG
D(2) dopamine receptor
(Homo sapiens (Human))
BDBM50088581
(CHEMBL3577345)
Show SMILES CCCCn1cc(CCCOc2ccc(cc2OC)C(=O)NCCCCN(CCC)[C@@H]2CCc3c(O)cccc3C2)nn1 |r|
Show InChI InChI=1S/C34H49N5O4/c1-4-6-21-39-25-28(36-37-39)12-10-22-43-32-17-14-27(24-33(32)42-3)34(41)35-18-7-8-20-38(19-5-2)29-15-16-30-26(23-29)11-9-13-31(30)40/h9,11,13-14,17,24-25,29,40H,4-8,10,12,15-16,18-23H2,1-3H3,(H,35,41)/t29-/m1/s1
Reactome pathway
n/an/an/an/a 830n/an/an/an/a
Friedrich Alexander University
Curated by ChEMBL
Assay Description
Intrinsic activity at human dopamine D2S receptor expressed in HEK293 cells co-transfected with Galpha0i assessed as [35S]GTPgammaS binding after 30 ...
J Med Chem 58: 2703-17 (2015)
Article DOI: 10.1021/jm501889t
BindingDB Entry DOI: 10.7270/Q2R49SHG
D(2) dopamine receptor
(Homo sapiens (Human))
BDBM50088581
(CHEMBL3577345)
Show SMILES CCCCn1cc(CCCOc2ccc(cc2OC)C(=O)NCCCCN(CCC)[C@@H]2CCc3c(O)cccc3C2)nn1 |r|
Show InChI InChI=1S/C34H49N5O4/c1-4-6-21-39-25-28(36-37-39)12-10-22-43-32-17-14-27(24-33(32)42-3)34(41)35-18-7-8-20-38(19-5-2)29-15-16-30-26(23-29)11-9-13-31(30)40/h9,11,13-14,17,24-25,29,40H,4-8,10,12,15-16,18-23H2,1-3H3,(H,35,41)/t29-/m1/s1
Reactome pathway
n/an/an/an/a 530n/an/an/an/a
Friedrich Alexander University
Curated by ChEMBL
Assay Description
Intrinsic activity at human dopamine D2L receptor expressed in HEK293 cells co-transfected with Galpha0i assessed as [35S]GTPgammaS binding after 30 ...
J Med Chem 58: 2703-17 (2015)
Article DOI: 10.1021/jm501889t
BindingDB Entry DOI: 10.7270/Q2R49SHG