BDBM50088630 2-Chloro-3-(3-methoxy-phenyl)-5-((R)-pyrrolidin-3-yloxy)-pyridine::CHEMBL10727
SMILES: COc1cccc(c1)-c1cc(O[C@@H]2CCNC2)cnc1Cl
InChI Key: InChIKey=RNYYNWBVOSEFNS-CYBMUJFWSA-N
Data: 1 IC50
Activity Spreadsheet -- Enzyme Inhibition Constant Data from BindingDB
Found 1 hit for monomerid = 50088630
Trg + Lig
Ki
nM
ΔG°
kcal/mole
IC50
nM
Kd
nM
EC50/IC50
nM
koff
s-1
kon
M-1s-1
pHTemp
°C
Neuronal acetylcholine receptor protein alpha-4/beta-2 subunit
(Rattus norvegicus (Rat))
BDBM50088630
(2-Chloro-3-(3-methoxy-phenyl)-5-((R)-pyrrolidin-3-...)
Show SMILES COc1cccc(c1)-c1cc(O[C@@H]2CCNC2)cnc1Cl
Show InChI InChI=1S/C16H17ClN2O2/c1-20-12-4-2-3-11(7-12)15-8-14(10-19-16(15)17)21-13-5-6-18-9-13/h2-4,7-8,10,13,18H,5-6,9H2,1H3/t13-/m1/s1
n/an/a 58n/an/an/an/an/an/a
R.W. Johnson Pharmaceutical Research Institute
Curated by ChEMBL
Assay Description
Evaluated for binding affinity towards nicotinic acetylcholine receptor alpha4-beta2
Bioorg Med Chem Lett 10: 1063-6 (2000)
BindingDB Entry DOI: 10.7270/Q2PK0HBC