BDBM50088634 2-Chloro-3-phenyl-5-((R)-pyrrolidin-3-yloxy)-pyridine::CHEMBL274135
SMILES: Clc1ncc(O[C@@H]2CCNC2)cc1-c1ccccc1
InChI Key: InChIKey=LJKVJIWDGOWYLR-GFCCVEGCSA-N
Data: 1 IC50
Activity Spreadsheet -- Enzyme Inhibition Constant Data from BindingDB
Found 1 hit for monomerid = 50088634
Trg + Lig
Ki
nM
ΔG°
kcal/mole
IC50
nM
Kd
nM
EC50/IC50
nM
koff
s-1
kon
M-1s-1
pHTemp
°C
Neuronal acetylcholine receptor protein alpha-4/beta-2 subunit
(Rattus norvegicus (Rat))
BDBM50088634
(2-Chloro-3-phenyl-5-((R)-pyrrolidin-3-yloxy)-pyrid...)
Show SMILES Clc1ncc(O[C@@H]2CCNC2)cc1-c1ccccc1
Show InChI InChI=1S/C15H15ClN2O/c16-15-14(11-4-2-1-3-5-11)8-13(10-18-15)19-12-6-7-17-9-12/h1-5,8,10,12,17H,6-7,9H2/t12-/m1/s1
n/an/a 75n/an/an/an/an/an/a
R.W. Johnson Pharmaceutical Research Institute
Curated by ChEMBL
Assay Description
Evaluated for binding affinity towards nicotinic acetylcholine receptor alpha4-beta2
Bioorg Med Chem Lett 10: 1063-6 (2000)
BindingDB Entry DOI: 10.7270/Q2PK0HBC