BDBM50088636 3-((R)-Pyrrolidin-3-yloxy)-pyridine::CHEMBL10260
SMILES: C1C[C@H](CN1)Oc1cccnc1
InChI Key: InChIKey=DCWKRPJLVIHGCZ-SECBINFHSA-N
Data: 1 IC50
Activity Spreadsheet -- Enzyme Inhibition Constant Data from BindingDB
Found 1 hit for monomerid = 50088636
Trg + Lig
Ki
nM
ΔG°
kcal/mole
IC50
nM
Kd
nM
EC50/IC50
nM
koff
s-1
kon
M-1s-1
pHTemp
°C
Neuronal acetylcholine receptor protein alpha-4/beta-2 subunit
(Rattus norvegicus (Rat))
BDBM50088636
(3-((R)-Pyrrolidin-3-yloxy)-pyridine | CHEMBL10260)
Show SMILES C1C[C@H](CN1)Oc1cccnc1
Show InChI InChI=1S/C9H12N2O/c1-2-8(6-10-4-1)12-9-3-5-11-7-9/h1-2,4,6,9,11H,3,5,7H2/t9-/m1/s1
n/an/a 45n/an/an/an/an/an/a
R.W. Johnson Pharmaceutical Research Institute
Curated by ChEMBL
Assay Description
Evaluated for binding affinity towards nicotinic acetylcholine receptor alpha4-beta2
Bioorg Med Chem Lett 10: 1063-6 (2000)
BindingDB Entry DOI: 10.7270/Q2PK0HBC