BDBM50088639 2-Chloro-3-methyl-5-((R)-pyrrolidin-3-yloxy)-pyridine::CHEMBL10256
SMILES: Cc1cc(O[C@@H]2CCNC2)cnc1Cl
InChI Key: InChIKey=LQQHYGJSIKIVRV-MRVPVSSYSA-N
Data: 1 IC50
Activity Spreadsheet -- Enzyme Inhibition Constant Data from BindingDB
Found 1 hit for monomerid = 50088639
Trg + Lig
Ki
nM
ΔG°
kcal/mole
IC50
nM
Kd
nM
EC50/IC50
nM
koff
s-1
kon
M-1s-1
pHTemp
°C
Neuronal acetylcholine receptor protein alpha-4/beta-2 subunit
(Rattus norvegicus (Rat))
BDBM50088639
(2-Chloro-3-methyl-5-((R)-pyrrolidin-3-yloxy)-pyrid...)
Show SMILES Cc1cc(O[C@@H]2CCNC2)cnc1Cl
Show InChI InChI=1S/C10H13ClN2O/c1-7-4-9(6-13-10(7)11)14-8-2-3-12-5-8/h4,6,8,12H,2-3,5H2,1H3/t8-/m1/s1
n/an/a 64n/an/an/an/an/an/a
R.W. Johnson Pharmaceutical Research Institute
Curated by ChEMBL
Assay Description
Evaluated for binding affinity towards nicotinic acetylcholine receptor alpha4-beta2
Bioorg Med Chem Lett 10: 1063-6 (2000)
BindingDB Entry DOI: 10.7270/Q2PK0HBC