BDBM50088645 4-[5-((R)-Pyrrolidin-3-yloxy)-pyridin-3-yl]-benzonitrile::CHEMBL415969
SMILES: N#Cc1ccc(cc1)-c1cncc(O[C@@H]2CCNC2)c1
InChI Key: InChIKey=GTALLYDLVPQOJQ-OAHLLOKOSA-N
Data: 1 IC50
Activity Spreadsheet -- Enzyme Inhibition Constant Data from BindingDB
Found 1 hit for monomerid = 50088645
Trg + Lig
Ki
nM
ΔG°
kcal/mole
IC50
nM
Kd
nM
EC50/IC50
nM
koff
s-1
kon
M-1s-1
pHTemp
°C
Neuronal acetylcholine receptor protein alpha-4/beta-2 subunit
(Rattus norvegicus (Rat))
BDBM50088645
(4-[5-((R)-Pyrrolidin-3-yloxy)-pyridin-3-yl]-benzon...)
Show SMILES N#Cc1ccc(cc1)-c1cncc(O[C@@H]2CCNC2)c1
Show InChI InChI=1S/C16H15N3O/c17-8-12-1-3-13(4-2-12)14-7-16(11-19-9-14)20-15-5-6-18-10-15/h1-4,7,9,11,15,18H,5-6,10H2/t15-/m1/s1
n/an/a 544n/an/an/an/an/an/a
R.W. Johnson Pharmaceutical Research Institute
Curated by ChEMBL
Assay Description
Evaluated for binding affinity towards nicotinic acetylcholine receptor alpha4-beta2
Bioorg Med Chem Lett 10: 1063-6 (2000)
BindingDB Entry DOI: 10.7270/Q2PK0HBC