BDBM50089091 CHEMBL3577696
SMILES: CN1C2N(CCc3c2[nH]c2ccc(O)cc32)C(=O)c2cc(NCc3ccc(cc3)-c3nnc(CCCCC(=O)NO)o3)ccc12
InChI Key:
Data: 1 IC50
Activity Spreadsheet -- Enzyme Inhibition Constant Data from BindingDB
Found 1 hit for monomerid = 50089091
Trg + Lig
Ki
nM
ΔG°
kcal/mole
IC50
nM
Kd
nM
EC50/IC50
nM
koff
s-1
kon
M-1s-1
pHTemp
°C
Histone deacetylase 1
(Homo sapiens (Human))
BDBM50089091
(CHEMBL3577696)
Show SMILES CN1C2N(CCc3c2[nH]c2ccc(O)cc32)C(=O)c2cc(NCc3ccc(cc3)-c3nnc(CCCCC(=O)NO)o3)ccc12
NCI pathway
Reactome pathway
n/an/a 93n/an/an/an/an/an/a
Fujian University of Traditional Chinese Medicine
Curated by ChEMBL
Assay Description
Inhibition of recombinant full length human HDAC1 (1 to 482) expressed in baculovirus infected insect Sf9 cells using fluorogenic HDAC substrate 3 af...
ACS Med Chem Lett 6: 239-43 (2015)
Article DOI: 10.1021/ml500327q
BindingDB Entry DOI: 10.7270/Q23F4RCK