BDBM50089124 4-[5-(4-Fluoro-phenyl)-4-pyridin-4-yl-1H-pyrrol-2-yl]-1-methyl-piperidin-4-ol::CHEMBL284015
SMILES: CN1CCC(O)(CC1)c1cc(c([nH]1)-c1ccc(F)cc1)-c1ccncc1
InChI Key: InChIKey=ANPWOFIXNRYHFQ-UHFFFAOYSA-N
Data: 2 IC50
Activity Spreadsheet -- Enzyme Inhibition Constant Data from BindingDB
Found 2 hits for monomerid = 50089124
Trg + Lig
Ki
nM
ΔG°
kcal/mole
IC50
nM
Kd
nM
EC50/IC50
nM
koff
s-1
kon
M-1s-1
pHTemp
°C
MAP kinase p38
(Mus musculus (mouse))
BDBM50089124
(4-[5-(4-Fluoro-phenyl)-4-pyridin-4-yl-1H-pyrrol-2-...)
Show SMILES CN1CCC(O)(CC1)c1cc(c([nH]1)-c1ccc(F)cc1)-c1ccncc1
Show InChI InChI=1S/C21H22FN3O/c1-25-12-8-21(26,9-13-25)19-14-18(15-6-10-23-11-7-15)20(24-19)16-2-4-17(22)5-3-16/h2-7,10-11,14,24,26H,8-9,12-13H2,1H3
Reactome pathway
n/an/a 130n/an/an/an/an/an/a
Novartis Pharma AG
Curated by ChEMBL
Assay Description
Inhibition of murine p38 alpha MAP kinase
Bioorg Med Chem Lett 10: 1261-4 (2000)
BindingDB Entry DOI: 10.7270/Q2XS5TMT
Prostaglandin G/H synthase (cyclooxygenase)
(Ovis aries (Sheep))
BDBM50089124
(4-[5-(4-Fluoro-phenyl)-4-pyridin-4-yl-1H-pyrrol-2-...)
Show SMILES CN1CCC(O)(CC1)c1cc(c([nH]1)-c1ccc(F)cc1)-c1ccncc1
Show InChI InChI=1S/C21H22FN3O/c1-25-12-8-21(26,9-13-25)19-14-18(15-6-10-23-11-7-15)20(24-19)16-2-4-17(22)5-3-16/h2-7,10-11,14,24,26H,8-9,12-13H2,1H3
n/an/a>1.00E+5n/an/an/an/an/an/a
Novartis Pharma AG
Curated by ChEMBL
Assay Description
Inhibition of Prostaglandin G/H synthase 1, COX-1
Bioorg Med Chem Lett 10: 1261-4 (2000)
BindingDB Entry DOI: 10.7270/Q2XS5TMT