BDBM50089218 CHEMBL3577737
SMILES: COC[C@H](C)Oc1cc(cc(c1)C(=O)Nc1ccn(C)n1)C#Cc1cccc(OCCN2CCOCC2)c1
InChI Key: InChIKey=SCKXJGWFLUCPHL-QFIPXVFZSA-N
Data: 1 EC50
Activity Spreadsheet -- Enzyme Inhibition Constant Data from BindingDB
Found 1 hit for monomerid = 50089218
Trg + Lig
Ki
nM
ΔG°
kcal/mole
IC50
nM
Kd
nM
EC50/IC50
nM
koff
s-1
kon
M-1s-1
pHTemp
°C
Glucokinase/Glucokinase regulatory protein
(Homo sapiens (Human))
BDBM50089218
(CHEMBL3577737)
Show SMILES COC[C@H](C)Oc1cc(cc(c1)C(=O)Nc1ccn(C)n1)C#Cc1cccc(OCCN2CCOCC2)c1 |r|
Show InChI InChI=1S/C29H34N4O5/c1-22(21-35-3)38-27-19-24(17-25(20-27)29(34)30-28-9-10-32(2)31-28)8-7-23-5-4-6-26(18-23)37-16-13-33-11-14-36-15-12-33/h4-6,9-10,17-20,22H,11-16,21H2,1-3H3,(H,30,31,34)/t22-/m0/s1
NCI pathway
Reactome pathway
n/an/an/an/a 16n/an/an/an/a
Yuhan Research Institute
Curated by ChEMBL
Assay Description
Activation of recombinant human pancreatic glucokinase using 10 mM glucose as substrate by G6PDH coupled assay
ACS Med Chem Lett 6: 296-301 (2015)
Article DOI: 10.1021/ml5004712
BindingDB Entry DOI: 10.7270/Q2ZP47VT