BDBM50089245 CHEMBL3577885
SMILES: C[C@@H](N(Cc1cccc(c1)C(O)=O)C(=O)c1cnc2ccccc2c1)c1ccc(F)cc1
InChI Key: InChIKey=BXNMZRPTQFVRFA-QGZVFWFLSA-N
Data: 1 KI  2 IC50
Activity Spreadsheet -- Enzyme Inhibition Constant Data from BindingDB
Found 3 hits for monomerid = 50089245
Trg + Lig
Ki
nM
ΔG°
kcal/mole
IC50
nM
Kd
nM
EC50/IC50
nM
koff
s-1
kon
M-1s-1
pHTemp
°C
Potassium voltage-gated channel subfamily H member 2
(Homo sapiens (Human))
BDBM50089245
(CHEMBL3577885)
Show SMILES C[C@@H](N(Cc1cccc(c1)C(O)=O)C(=O)c1cnc2ccccc2c1)c1ccc(F)cc1 |r|
Show InChI InChI=1S/C26H21FN2O3/c1-17(19-9-11-23(27)12-10-19)29(16-18-5-4-7-21(13-18)26(31)32)25(30)22-14-20-6-2-3-8-24(20)28-15-22/h2-15,17H,16H2,1H3,(H,31,32)/t17-/m1/s1
Reactome pathway
>1.59E+4n/an/an/an/an/an/an/an/a
Pfizer Inc.
Curated by ChEMBL
Assay Description
Inhibition of dofetilide binding to human ERG
ACS Med Chem Lett 6: 419-24 (2015)
Article DOI: 10.1021/ml500479v
BindingDB Entry DOI: 10.7270/Q2FQ9ZBC
Transient receptor potential cation channel subfamily M member 8 (TRPM8)
(Homo sapiens (Human))
BDBM50089245
(CHEMBL3577885)
Show SMILES C[C@@H](N(Cc1cccc(c1)C(O)=O)C(=O)c1cnc2ccccc2c1)c1ccc(F)cc1 |r|
Show InChI InChI=1S/C26H21FN2O3/c1-17(19-9-11-23(27)12-10-19)29(16-18-5-4-7-21(13-18)26(31)32)25(30)22-14-20-6-2-3-8-24(20)28-15-22/h2-15,17H,16H2,1H3,(H,31,32)/t17-/m1/s1
n/an/a 181n/an/an/an/an/an/a
Pfizer Inc.
Curated by ChEMBL
Assay Description
Antagonist activity against human recombinant TRPM8 expressed in CHO T-rex cells assessed as inhibition of WS12-induced calcium response pre-incubate...
ACS Med Chem Lett 6: 419-24 (2015)
Article DOI: 10.1021/ml500479v
BindingDB Entry DOI: 10.7270/Q2FQ9ZBC
Transient receptor potential cation channel subfamily M member 8 (TRPM8)
(Homo sapiens (Human))
BDBM50089245
(CHEMBL3577885)
Show SMILES C[C@@H](N(Cc1cccc(c1)C(O)=O)C(=O)c1cnc2ccccc2c1)c1ccc(F)cc1 |r|
Show InChI InChI=1S/C26H21FN2O3/c1-17(19-9-11-23(27)12-10-19)29(16-18-5-4-7-21(13-18)26(31)32)25(30)22-14-20-6-2-3-8-24(20)28-15-22/h2-15,17H,16H2,1H3,(H,31,32)/t17-/m1/s1
n/an/a 103n/an/an/an/an/an/a
Pfizer Inc.
Curated by ChEMBL
Assay Description
Antagonist activity against human TRPM8 by single cell patch clamp electrophysiology
ACS Med Chem Lett 6: 419-24 (2015)
Article DOI: 10.1021/ml500479v
BindingDB Entry DOI: 10.7270/Q2FQ9ZBC