BDBM50089305 CHEMBL3577927
SMILES: Clc1ccc(s1)S(=O)(=O)Nc1cc(cnc1Cl)-c1cc2c(ncnc2s1)-c1ccncc1
InChI Key: InChIKey=MGPZMIFXUOWABF-UHFFFAOYSA-N
Data: 2 IC50
Activity Spreadsheet -- Enzyme Inhibition Constant Data from BindingDB
Found 2 hits for monomerid = 50089305
Trg + Lig
Ki
nM
ΔG°
kcal/mole
IC50
nM
Kd
nM
EC50/IC50
nM
koff
s-1
kon
M-1s-1
pHTemp
°C
Phosphatidylinositol 4,5-bisphosphate 3-kinase catalytic subunit alpha isoform
(Homo sapiens (Human))
BDBM50089305
(CHEMBL3577927)
Show SMILES Clc1ccc(s1)S(=O)(=O)Nc1cc(cnc1Cl)-c1cc2c(ncnc2s1)-c1ccncc1
Show InChI InChI=1S/C20H11Cl2N5O2S3/c21-16-1-2-17(31-16)32(28,29)27-14-7-12(9-24-19(14)22)15-8-13-18(11-3-5-23-6-4-11)25-10-26-20(13)30-15/h1-10,27H
NCI pathway
Reactome pathway
n/an/a 0.150n/an/an/an/an/an/a
PKUCare Pharmaceutical R&D Center
Curated by ChEMBL
Assay Description
Inhibition of PI3Kalpha (unknown origin) using PIP2/PS as substrate after 1 hr by luciferase-based luminescence assay
ACS Med Chem Lett 6: 434-8 (2015)
Article DOI: 10.1021/ml5005014
BindingDB Entry DOI: 10.7270/Q29Z96M1
Serine/threonine-protein kinase mTOR
(Homo sapiens (Human))
BDBM50089305
(CHEMBL3577927)
Show SMILES Clc1ccc(s1)S(=O)(=O)Nc1cc(cnc1Cl)-c1cc2c(ncnc2s1)-c1ccncc1
Show InChI InChI=1S/C20H11Cl2N5O2S3/c21-16-1-2-17(31-16)32(28,29)27-14-7-12(9-24-19(14)22)15-8-13-18(11-3-5-23-6-4-11)25-10-26-20(13)30-15/h1-10,27H
NCI pathway
Reactome pathway
n/an/a 26n/an/an/an/an/an/a
PKUCare Pharmaceutical R&D Center
Curated by ChEMBL
Assay Description
Inhibition of mTOR (unknown origin) using GFP-4E-BP1 as substrate after 1 hr by TR-FRET assay
ACS Med Chem Lett 6: 434-8 (2015)
Article DOI: 10.1021/ml5005014
BindingDB Entry DOI: 10.7270/Q29Z96M1