BDBM50089544 5-(6,6-Dimethyl-heptylamino)-1H-quinolin-2-one::CHEMBL32658
SMILES: CC(C)(C)CCCCCNc1cccc2[nH]c(=O)ccc12
InChI Key: InChIKey=AMMAYCQJRNXTDK-UHFFFAOYSA-N
Data: 1 IC50
Activity Spreadsheet -- Enzyme Inhibition Constant Data from BindingDB
Found 1 hit for monomerid = 50089544
Trg + Lig
Ki
nM
ΔG°
kcal/mole
IC50
nM
Kd
nM
EC50/IC50
nM
koff
s-1
kon
M-1s-1
pHTemp
°C
Chitin synthase
(Candida albicans)
BDBM50089544
(5-(6,6-Dimethyl-heptylamino)-1H-quinolin-2-one | C...)
Show SMILES CC(C)(C)CCCCCNc1cccc2[nH]c(=O)ccc12
Show InChI InChI=1S/C18H26N2O/c1-18(2,3)12-5-4-6-13-19-15-8-7-9-16-14(15)10-11-17(21)20-16/h7-11,19H,4-6,12-13H2,1-3H3,(H,20,21)
n/an/a>3.50E+5n/an/an/an/an/an/a
Nippon Roche Research Center
Curated by ChEMBL
Assay Description
Inhibitory of Candida albicans chitin synthase 1
Bioorg Med Chem Lett 10: 1459-62 (2000)
BindingDB Entry DOI: 10.7270/Q2R210MK