BDBM50089545 ((E)-6,6-Dimethyl-hept-2-en-4-ynyl)-quinolin-5-yl-amine::CHEMBL422402
SMILES: CC(C)(C)C#C\C=C\CNc1cccc2ncccc12
InChI Key: InChIKey=BDHMYKHRGVNJFU-GQCTYLIASA-N
Data: 1 IC50
Activity Spreadsheet -- Enzyme Inhibition Constant Data from BindingDB
Found 1 hit for monomerid = 50089545
Trg + Lig
Ki
nM
ΔG°
kcal/mole
IC50
nM
Kd
nM
EC50/IC50
nM
koff
s-1
kon
M-1s-1
pHTemp
°C
Chitin synthase
(Candida albicans)
BDBM50089545
(((E)-6,6-Dimethyl-hept-2-en-4-ynyl)-quinolin-5-yl-...)
Show SMILES CC(C)(C)C#C\C=C\CNc1cccc2ncccc12
Show InChI InChI=1S/C18H20N2/c1-18(2,3)12-5-4-6-13-19-16-10-7-11-17-15(16)9-8-14-20-17/h4,6-11,14,19H,13H2,1-3H3/b6-4+
n/an/a 4.50E+3n/an/an/an/an/an/a
Nippon Roche Research Center
Curated by ChEMBL
Assay Description
Inhibitory of Candida albicans chitin synthase 1
Bioorg Med Chem Lett 10: 1459-62 (2000)
BindingDB Entry DOI: 10.7270/Q2R210MK