BDBM50089655 CHEMBL3576976
SMILES: Cc1ccc(cc1)S(=O)(=O)n1cc(C(=O)C(=O)N[C@@H](Cc2cnc[nH]2)C(=O)N[C@@H](CCC(O)=O)C(O)=O)c2ccccc12
InChI Key:
Data: 1 KI  2 IC50
Activity Spreadsheet -- Enzyme Inhibition Constant Data from BindingDB
Found 3 hits for monomerid = 50089655
Trg + Lig
Ki
nM
ΔG°
kcal/mole
IC50
nM
Kd
nM
EC50/IC50
nM
koff
s-1
kon
M-1s-1
pHTemp
°C
Cyclooxygenase
(Homo sapiens (Human))
BDBM50089655
(CHEMBL3576976)
Show SMILES Cc1ccc(cc1)S(=O)(=O)n1cc(C(=O)C(=O)N[C@@H](Cc2cnc[nH]2)C(=O)N[C@@H](CCC(O)=O)C(O)=O)c2ccccc12 |r|
NCI pathway
Reactome pathway
12n/an/an/an/an/an/an/an/a
Guru Nanak Dev University
Curated by ChEMBL
Assay Description
Competitive inhibition of human recombinant COX-2 by UV-Visible spectrophotometry
Eur J Med Chem 97: 104-23 (2015)
Article DOI: 10.1016/j.ejmech.2015.04.044
BindingDB Entry DOI: 10.7270/Q2N87CJN
Prostaglandin G/H synthase (cyclooxygenase)
(Ovis aries (Sheep))
BDBM50089655
(CHEMBL3576976)
Show SMILES Cc1ccc(cc1)S(=O)(=O)n1cc(C(=O)C(=O)N[C@@H](Cc2cnc[nH]2)C(=O)N[C@@H](CCC(O)=O)C(O)=O)c2ccccc12 |r|
n/an/a 1.29E+4n/an/an/an/an/an/a
Guru Nanak Dev University
Curated by ChEMBL
Assay Description
Inhibition of ovine COX-1 assessed as PGF2alpha formation using arachidonic acid as substrate pretreated with compound for 20 mins prior to substrate...
Eur J Med Chem 97: 104-23 (2015)
Article DOI: 10.1016/j.ejmech.2015.04.044
BindingDB Entry DOI: 10.7270/Q2N87CJN
Cyclooxygenase
(Homo sapiens (Human))
BDBM50089655
(CHEMBL3576976)
Show SMILES Cc1ccc(cc1)S(=O)(=O)n1cc(C(=O)C(=O)N[C@@H](Cc2cnc[nH]2)C(=O)N[C@@H](CCC(O)=O)C(O)=O)c2ccccc12 |r|
NCI pathway
Reactome pathway
n/an/a 540n/an/an/an/an/an/a
Guru Nanak Dev University
Curated by ChEMBL
Assay Description
Inhibition of human recombinant COX-2 assessed as PGF2 alpha formation using arachidonic acid as substrate pretreated with compound for 20 mins prior...
Eur J Med Chem 97: 104-23 (2015)
Article DOI: 10.1016/j.ejmech.2015.04.044
BindingDB Entry DOI: 10.7270/Q2N87CJN