BDBM50089847 CHEMBL3577620
SMILES: [H][C@@]12OC(C)(C)O[C@]([H])([C@H]1C)C(C)(C)[C@@H](CC)OC(=O)[C@H](C)[C@@H](OC(=O)NCCCNC(=N)NC(=O)NC)[C@H](C)[C@@H](OCC#C)[C@](C)(O)C[C@H]2C
InChI Key: InChIKey=YHYHZLQWOPZYLB-BRHDICNJSA-N
Data: 1 IC50
Activity Spreadsheet -- Enzyme Inhibition Constant Data from BindingDB
Found 1 hit for monomerid = 50089847
Trg + Lig
Ki
nM
ΔG°
kcal/mole
IC50
nM
Kd
nM
EC50/IC50
nM
koff
s-1
kon
M-1s-1
pHTemp
°C
Chitinase B
(Serratia marcescens)
BDBM50089847
(CHEMBL3577620)
Show SMILES [H][C@@]12OC(C)(C)O[C@]([H])([C@H]1C)C(C)(C)[C@@H](CC)OC(=O)[C@H](C)[C@@H](OC(=O)NCCCNC(=N)NC(=O)NC)[C@H](C)[C@@H](OCC#C)[C@](C)(O)C[C@H]2C |r,@@:11|
Show InChI InChI=1S/C35H61N5O9/c1-13-18-45-28-22(5)26(47-32(43)39-17-15-16-38-30(36)40-31(42)37-12)23(6)29(41)46-24(14-2)33(7,8)27-21(4)25(48-34(9,10)49-27)20(3)19-35(28,11)44/h1,20-28,44H,14-19H2,2-12H3,(H,39,43)(H4,36,37,38,40,42)/t20-,21+,22+,23-,24-,25+,26+,27-,28-,35-/m1/s1
n/an/a 36n/an/an/an/an/an/a
Kitasato University
Curated by ChEMBL
Assay Description
Inhibition of Serratia marcescens chitinase ChiB assessed as reduction in chitinolytic activity using 4MU-(GlcNAc)2 substrate by fluorescence based a...
J Med Chem 58: 4984-97 (2015)
Article DOI: 10.1021/acs.jmedchem.5b00175
BindingDB Entry DOI: 10.7270/Q2VT1TV5