BDBM50089946 CHEMBL3581182
SMILES: OC1=C(Sc2ccccc2Cl)C(=O)CC(C1)c1c(Cl)ccc(c1Cl)-c1ccccc1Cl
InChI Key: InChIKey=BPYHOWMZRJZIPD-UHFFFAOYSA-N
Data: 1 IC50
Activity Spreadsheet -- Enzyme Inhibition Constant Data from BindingDB
Found 1 hit for monomerid = 50089946
Trg + Lig
Ki
nM
ΔG°
kcal/mole
IC50
nM
Kd
nM
EC50/IC50
nM
koff
s-1
kon
M-1s-1
pHTemp
°C
Lactate dehydrogenase A (LDHA)
(Homo sapiens (Human))
BDBM50089946
(CHEMBL3581182)
Show SMILES OC1=C(Sc2ccccc2Cl)C(=O)CC(C1)c1c(Cl)ccc(c1Cl)-c1ccccc1Cl |c:1|
Show InChI InChI=1S/C24H16Cl4O2S/c25-16-6-2-1-5-14(16)15-9-10-18(27)22(23(15)28)13-11-19(29)24(20(30)12-13)31-21-8-4-3-7-17(21)26/h1-10,13,29H,11-12H2
Reactome pathway
n/an/a 60n/an/an/an/an/an/a
Genentech
Curated by ChEMBL
Assay Description
Inhibition of human LDH-A by biochemical assay
Bioorg Med Chem Lett 25: 75-82 (2015)
Article DOI: 10.1016/j.bmcl.2014.11.008
BindingDB Entry DOI: 10.7270/Q2BR8TXC