BDBM50089948 CHEMBL3581180
SMILES: CC(C)Oc1ccc(Cl)c(C2CC(O)=C(Sc3ccccc3Cl)C(=O)C2)c1Cl
InChI Key: InChIKey=WFMYWBXRYDWOCB-UHFFFAOYSA-N
Data: 1 IC50
Activity Spreadsheet -- Enzyme Inhibition Constant Data from BindingDB
Found 1 hit for monomerid = 50089948
Trg + Lig
Ki
nM
ΔG°
kcal/mole
IC50
nM
Kd
nM
EC50/IC50
nM
koff
s-1
kon
M-1s-1
pHTemp
°C
Lactate dehydrogenase A (LDHA)
(Homo sapiens (Human))
BDBM50089948
(CHEMBL3581180)
Show SMILES CC(C)Oc1ccc(Cl)c(C2CC(O)=C(Sc3ccccc3Cl)C(=O)C2)c1Cl |t:13|
Show InChI InChI=1S/C21H19Cl3O3S/c1-11(2)27-17-8-7-14(23)19(20(17)24)12-9-15(25)21(16(26)10-12)28-18-6-4-3-5-13(18)22/h3-8,11-12,25H,9-10H2,1-2H3
Reactome pathway
n/an/a 90n/an/an/an/an/an/a
Genentech
Curated by ChEMBL
Assay Description
Inhibition of human LDH-A by biochemical assay
Bioorg Med Chem Lett 25: 75-82 (2015)
Article DOI: 10.1016/j.bmcl.2014.11.008
BindingDB Entry DOI: 10.7270/Q2BR8TXC