BDBM50090082 CHEMBL3581529::US9216988, 135
SMILES: CC(=O)N1CCN(CC1)c1ccc(CN(C2CCC2)S(=O)(=O)c2ccccc2)c(F)c1
InChI Key: InChIKey=PIGCNHMXDYACOO-UHFFFAOYSA-N
Data: 2 IC50  1 EC50
PDB links: 1 PDB ID matches this monomer.
Activity Spreadsheet -- Enzyme Inhibition Constant Data from BindingDB
Found 3 hits for monomerid = 50090082
Trg + Lig
Ki
nM
ΔG°
kcal/mole
IC50
nM
Kd
nM
EC50/IC50
nM
koff
s-1
kon
M-1s-1
pHTemp
°C
Nuclear receptor ROR-gamma (RORC)
(Homo sapiens (Human))
BDBM50090082
(CHEMBL3581529 | US9216988, 135)
Show SMILES CC(=O)N1CCN(CC1)c1ccc(CN(C2CCC2)S(=O)(=O)c2ccccc2)c(F)c1
Show InChI InChI=1S/C23H28FN3O3S/c1-18(28)25-12-14-26(15-13-25)21-11-10-19(23(24)16-21)17-27(20-6-5-7-20)31(29,30)22-8-3-2-4-9-22/h2-4,8-11,16,20H,5-7,12-15,17H2,1H3
US Patent
n/an/a 249n/an/an/an/a7.4n/a
Genentech, Inc.
US Patent
Assay Description
On day of the assay, 100 uL of 0.05% CHAPS (in deionized H2O) was added to all wells of the GFB Unifilter plate and allowed soak for 1 h. A wash bu...
US Patent US9216988 (2015)
BindingDB Entry DOI: 10.7270/Q2TB15QC
3D
3D Structure (crystal)
Nuclear receptor ROR-gamma (RORC)
(Homo sapiens (Human))
BDBM50090082
(CHEMBL3581529 | US9216988, 135)
Show SMILES CC(=O)N1CCN(CC1)c1ccc(CN(C2CCC2)S(=O)(=O)c2ccccc2)c(F)c1
Show InChI InChI=1S/C23H28FN3O3S/c1-18(28)25-12-14-26(15-13-25)21-11-10-19(23(24)16-21)17-27(20-6-5-7-20)31(29,30)22-8-3-2-4-9-22/h2-4,8-11,16,20H,5-7,12-15,17H2,1H3
n/an/an/an/a 69n/an/an/an/a
Genentech
Curated by ChEMBL
Assay Description
Agonist activity at N-terminal 6xHis-tagged human RORc ligand binding domain (241 to 486) expressed in bacterial expression system assessed as activa...
ACS Med Chem Lett 6: 276-81 (2015)
Article DOI: 10.1021/ml500420y
BindingDB Entry DOI: 10.7270/Q2TT4SPB
3D
3D Structure (crystal)
Nuclear receptor ROR-gamma (RORC)
(Homo sapiens (Human))
BDBM50090082
(CHEMBL3581529 | US9216988, 135)
Show SMILES CC(=O)N1CCN(CC1)c1ccc(CN(C2CCC2)S(=O)(=O)c2ccccc2)c(F)c1
Show InChI InChI=1S/C23H28FN3O3S/c1-18(28)25-12-14-26(15-13-25)21-11-10-19(23(24)16-21)17-27(20-6-5-7-20)31(29,30)22-8-3-2-4-9-22/h2-4,8-11,16,20H,5-7,12-15,17H2,1H3
n/an/a 250n/an/an/an/an/an/a
Genentech
Curated by ChEMBL
Assay Description
Displacement of [3H2]-25-hydroxycholesterol from N-terminal 6xHis-tagged human RORc ligand binding domain (241 to 486) expressed in bacterial express...
ACS Med Chem Lett 6: 276-81 (2015)
Article DOI: 10.1021/ml500420y
BindingDB Entry DOI: 10.7270/Q2TT4SPB
3D
3D Structure (crystal)