BDBM50090092 CHEMBL3581539::US9216988, 85
SMILES: CC(=O)N1CCN(CC1)c1ccc(CN(C2CCC2)S(=O)(=O)Cc2ccccc2Cl)c(F)c1
InChI Key: InChIKey=GTLGVEZIQDSKAB-UHFFFAOYSA-N
Data: 2 IC50  1 EC50
Activity Spreadsheet -- Enzyme Inhibition Constant Data from BindingDB
Found 3 hits for monomerid = 50090092
Trg + Lig
Ki
nM
ΔG°
kcal/mole
IC50
nM
Kd
nM
EC50/IC50
nM
koff
s-1
kon
M-1s-1
pHTemp
°C
Nuclear receptor ROR-gamma (RORC)
(Homo sapiens (Human))
BDBM50090092
(CHEMBL3581539 | US9216988, 85)
Show SMILES CC(=O)N1CCN(CC1)c1ccc(CN(C2CCC2)S(=O)(=O)Cc2ccccc2Cl)c(F)c1
Show InChI InChI=1S/C24H29ClFN3O3S/c1-18(30)27-11-13-28(14-12-27)22-10-9-19(24(26)15-22)16-29(21-6-4-7-21)33(31,32)17-20-5-2-3-8-23(20)25/h2-3,5,8-10,15,21H,4,6-7,11-14,16-17H2,1H3
US Patent
n/an/a 9n/an/an/an/a7.4n/a
Genentech, Inc.
US Patent
Assay Description
On day of the assay, 100 uL of 0.05% CHAPS (in deionized H2O) was added to all wells of the GFB Unifilter plate and allowed soak for 1 h. A wash bu...
US Patent US9216988 (2015)
BindingDB Entry DOI: 10.7270/Q2TB15QC
Nuclear receptor ROR-gamma (RORC)
(Homo sapiens (Human))
BDBM50090092
(CHEMBL3581539 | US9216988, 85)
Show SMILES CC(=O)N1CCN(CC1)c1ccc(CN(C2CCC2)S(=O)(=O)Cc2ccccc2Cl)c(F)c1
Show InChI InChI=1S/C24H29ClFN3O3S/c1-18(30)27-11-13-28(14-12-27)22-10-9-19(24(26)15-22)16-29(21-6-4-7-21)33(31,32)17-20-5-2-3-8-23(20)25/h2-3,5,8-10,15,21H,4,6-7,11-14,16-17H2,1H3
n/an/an/an/a 4n/an/an/an/a
Genentech
Curated by ChEMBL
Assay Description
Inverse agonist activity at N-terminal 6xHis-tagged human RORc ligand binding domain (241 to 486) expressed in bacterial expression system assessed a...
ACS Med Chem Lett 6: 276-81 (2015)
Article DOI: 10.1021/ml500420y
BindingDB Entry DOI: 10.7270/Q2TT4SPB
Nuclear receptor ROR-gamma (RORC)
(Homo sapiens (Human))
BDBM50090092
(CHEMBL3581539 | US9216988, 85)
Show SMILES CC(=O)N1CCN(CC1)c1ccc(CN(C2CCC2)S(=O)(=O)Cc2ccccc2Cl)c(F)c1
Show InChI InChI=1S/C24H29ClFN3O3S/c1-18(30)27-11-13-28(14-12-27)22-10-9-19(24(26)15-22)16-29(21-6-4-7-21)33(31,32)17-20-5-2-3-8-23(20)25/h2-3,5,8-10,15,21H,4,6-7,11-14,16-17H2,1H3
n/an/a 9n/an/an/an/an/an/a
Genentech
Curated by ChEMBL
Assay Description
Displacement of [3H2]-25-hydroxycholesterol from N-terminal 6xHis-tagged human RORc ligand binding domain (241 to 486) expressed in bacterial express...
ACS Med Chem Lett 6: 276-81 (2015)
Article DOI: 10.1021/ml500420y
BindingDB Entry DOI: 10.7270/Q2TT4SPB