BDBM50090420 4-(3-Methyl-2,5-dioxo-2,5-dihydro-pyrrol-1-ylamino)-2-(5-methyl-thiophen-2-yl)-pyrimidine-5-carboxylic acid ethyl ester::CHEMBL42650::ethyl 4-(3-methyl-2,5-dioxo-2H-pyrrol-1(5H)-ylamino)-2-(5-methylthiophen-2-yl)pyrimidine-5-carboxylate
SMILES: CCOC(=O)c1cnc(nc1NN1C(=O)C=C(C)C1=O)-c1ccc(C)s1
InChI Key: InChIKey=AHRPMNUHBXZQDF-UHFFFAOYSA-N
Data: 1 IC50
Activity Spreadsheet -- Enzyme Inhibition Constant Data from BindingDB
Found 1 hit for monomerid = 50090420
Trg + Lig
Ki
nM
ΔG°
kcal/mole
IC50
nM
Kd
nM
EC50/IC50
nM
koff
s-1
kon
M-1s-1
pHTemp
°C
Proto-oncogene c-JUN/protein c-fos
(Homo sapiens (Human))
BDBM50090420
(4-(3-Methyl-2,5-dioxo-2,5-dihydro-pyrrol-1-ylamino...)
Show SMILES CCOC(=O)c1cnc(nc1NN1C(=O)C=C(C)C1=O)-c1ccc(C)s1 |t:16|
Show InChI InChI=1S/C17H16N4O4S/c1-4-25-17(24)11-8-18-15(12-6-5-10(3)26-12)19-14(11)20-21-13(22)7-9(2)16(21)23/h5-8H,4H2,1-3H3,(H,18,19,20)
n/an/a 200n/an/an/an/an/an/a
Signal Pharmaceuticals, Inc.
Curated by ChEMBL
Assay Description
Inhibition of AP-1 (activator protein-1) mediated transcriptional activation in Jurkat T-cells
Bioorg Med Chem Lett 10: 1645-8 (2000)
BindingDB Entry DOI: 10.7270/Q2F190XH