BDBM50090427 2-(3-Methoxy-phenyl)-4-(3-methyl-2,5-dioxo-2,5-dihydro-pyrrol-1-ylamino)-pyrimidine-5-carboxylic acid ethyl ester::CHEMBL290202::ethyl 2-(3-methoxyphenyl)-4-(3-methyl-2,5-dioxo-2H-pyrrol-1(5H)-ylamino)pyrimidine-5-carboxylate
SMILES: CCOC(=O)c1cnc(nc1NN1C(=O)C=C(C)C1=O)-c1cccc(OC)c1
InChI Key: InChIKey=SSWGMDXEHBHBHE-UHFFFAOYSA-N
Data: 1 IC50
Activity Spreadsheet -- Enzyme Inhibition Constant Data from BindingDB
Found 1 hit for monomerid = 50090427
Trg + Lig
Ki
nM
ΔG°
kcal/mole
IC50
nM
Kd
nM
EC50/IC50
nM
koff
s-1
kon
M-1s-1
pHTemp
°C
Proto-oncogene c-JUN/protein c-fos
(Homo sapiens (Human))
BDBM50090427
(2-(3-Methoxy-phenyl)-4-(3-methyl-2,5-dioxo-2,5-dih...)
Show SMILES CCOC(=O)c1cnc(nc1NN1C(=O)C=C(C)C1=O)-c1cccc(OC)c1 |t:16|
Show InChI InChI=1S/C19H18N4O5/c1-4-28-19(26)14-10-20-16(12-6-5-7-13(9-12)27-3)21-17(14)22-23-15(24)8-11(2)18(23)25/h5-10H,4H2,1-3H3,(H,20,21,22)
n/an/a 5.00E+3n/an/an/an/an/an/a
Signal Pharmaceuticals, Inc.
Curated by ChEMBL
Assay Description
Inhibition of AP-1 (activator protein-1) mediated transcriptional activation in Jurkat T-cells
Bioorg Med Chem Lett 10: 1645-8 (2000)
BindingDB Entry DOI: 10.7270/Q2F190XH