BDBM50090429 2-(3,5-Dichloro-phenyl)-4-(3-methyl-2,5-dioxo-2,5-dihydro-pyrrol-1-ylamino)-pyrimidine-5-carboxylic acid ethyl ester::CHEMBL296202::ethyl 2-(3,5-dichlorophenyl)-4-(3-methyl-2,5-dioxo-2H-pyrrol-1(5H)-ylamino)pyrimidine-5-carboxylate
SMILES: CCOC(=O)c1cnc(nc1NN1C(=O)C=C(C)C1=O)-c1cc(Cl)cc(Cl)c1
InChI Key: InChIKey=DWVXJMXXTULGDP-UHFFFAOYSA-N
Data: 1 IC50
Activity Spreadsheet -- Enzyme Inhibition Constant Data from BindingDB
Found 1 hit for monomerid = 50090429
Trg + Lig
Ki
nM
ΔG°
kcal/mole
IC50
nM
Kd
nM
EC50/IC50
nM
koff
s-1
kon
M-1s-1
pHTemp
°C
Proto-oncogene c-JUN/protein c-fos
(Homo sapiens (Human))
BDBM50090429
(2-(3,5-Dichloro-phenyl)-4-(3-methyl-2,5-dioxo-2,5-...)
Show SMILES CCOC(=O)c1cnc(nc1NN1C(=O)C=C(C)C1=O)-c1cc(Cl)cc(Cl)c1 |t:16|
Show InChI InChI=1S/C18H14Cl2N4O4/c1-3-28-18(27)13-8-21-15(10-5-11(19)7-12(20)6-10)22-16(13)23-24-14(25)4-9(2)17(24)26/h4-8H,3H2,1-2H3,(H,21,22,23)
n/an/a 300n/an/an/an/an/an/a
Signal Pharmaceuticals, Inc.
Curated by ChEMBL
Assay Description
Inhibition of AP-1 (activator protein-1) mediated transcriptional activation in Jurkat T-cells
Bioorg Med Chem Lett 10: 1645-8 (2000)
BindingDB Entry DOI: 10.7270/Q2F190XH