BDBM50090430 4-(3-Methyl-2,5-dioxo-2,5-dihydro-pyrrol-1-ylamino)-2-thiophen-2-yl-pyrimidine-5-carboxylic acid ethyl ester::CHEMBL43549::ethyl 4-(3-methyl-2,5-dioxo-2H-pyrrol-1(5H)-ylamino)-2-(thiophen-2-yl)pyrimidine-5-carboxylate
SMILES: CCOC(=O)c1cnc(nc1NN1C(=O)C=C(C)C1=O)-c1cccs1
InChI Key: InChIKey=KBCXTBOXZPZBNM-UHFFFAOYSA-N
Data: 2 IC50
Activity Spreadsheet -- Enzyme Inhibition Constant Data from BindingDB
Found 2 hits for monomerid = 50090430
Trg + Lig
Ki
nM
ΔG°
kcal/mole
IC50
nM
Kd
nM
EC50/IC50
nM
koff
s-1
kon
M-1s-1
pHTemp
°C
Proto-oncogene c-JUN/protein c-fos
(Homo sapiens (Human))
BDBM50090430
(4-(3-Methyl-2,5-dioxo-2,5-dihydro-pyrrol-1-ylamino...)
Show SMILES CCOC(=O)c1cnc(nc1NN1C(=O)C=C(C)C1=O)-c1cccs1 |t:16|
Show InChI InChI=1S/C16H14N4O4S/c1-3-24-16(23)10-8-17-14(11-5-4-6-25-11)18-13(10)19-20-12(21)7-9(2)15(20)22/h4-8H,3H2,1-2H3,(H,17,18,19)
n/an/a 20n/an/an/an/an/an/a
Signal Pharmaceuticals, Inc.
Curated by ChEMBL
Assay Description
Inhibition of AP-1 (activator protein-1) mediated transcriptional activation in Jurkat T-cells
Bioorg Med Chem Lett 10: 1645-8 (2000)
BindingDB Entry DOI: 10.7270/Q2F190XH
Transcription factor AP-1
(Homo sapiens (Human))
BDBM50090430
(4-(3-Methyl-2,5-dioxo-2,5-dihydro-pyrrol-1-ylamino...)
Show SMILES CCOC(=O)c1cnc(nc1NN1C(=O)C=C(C)C1=O)-c1cccs1 |t:16|
Show InChI InChI=1S/C16H14N4O4S/c1-3-24-16(23)10-8-17-14(11-5-4-6-25-11)18-13(10)19-20-12(21)7-9(2)15(20)22/h4-8H,3H2,1-2H3,(H,17,18,19)
n/an/a 20n/an/an/an/an/an/a
University of Texas Medical Branch
Curated by ChEMBL
Assay Description
Inhibition of AP-1-mediated transcriptional activation in human Jurkat cells by luciferase reporter gene assay
J Med Chem 57: 6930-48 (2014)
Article DOI: 10.1021/jm5004733
BindingDB Entry DOI: 10.7270/Q2222WDT