BDBM50090474 CHEMBL3581710
SMILES: [H][C@@]1(CC[C@]2(C)[C@]1([H])[C@H](O)C[C@]1([H])[C@@]3(C)C[C@@H](O)[C@H](O)C(C)(C)[C@]3([H])CC[C@@]21C)[C@](C)(CCC(=O)C(C)=C)O[C@@H]1O[C@H](CO[C@@H]2O[C@H](CO)[C@@H](O)[C@H](O)[C@H]2O)[C@@H](O)[C@H](O)[C@H]1O
InChI Key: InChIKey=OJTJYBVJBCPKPZ-UHFFFAOYSA-N
Data: 1 IC50
Activity Spreadsheet -- Enzyme Inhibition Constant Data from BindingDB
Found 1 hit for monomerid = 50090474
Trg + Lig
Ki
nM
ΔG°
kcal/mole
IC50
nM
Kd
nM
EC50/IC50
nM
koff
s-1
kon
M-1s-1
pHTemp
°C
Signal transducer and activator of transcription 3
(Homo sapiens (Human))
BDBM50090474
(CHEMBL3581710)
Show SMILES [H][C@@]1(CC[C@]2(C)[C@]1([H])[C@H](O)C[C@]1([H])[C@@]3(C)C[C@@H](O)[C@H](O)C(C)(C)[C@]3([H])CC[C@@]21C)[C@](C)(CCC(=O)C(C)=C)O[C@@H]1O[C@H](CO[C@@H]2O[C@H](CO)[C@@H](O)[C@H](O)[C@H]2O)[C@@H](O)[C@H](O)[C@H]1O |r|
Show InChI InChI=1S/C22H25NO6S/c1-13-10-16(23-21(25)22(26)27)11-14(2)20(13)30(28,29)17-8-9-19(24)18(12-17)15-6-4-3-5-7-15/h8-12,15,24H,3-7H2,1-2H3,(H,23,25)(H,26,27)
n/an/a 270n/an/an/an/an/an/a
Chungbuk National University
Curated by ChEMBL
Assay Description
Inhibition of IL6-induced STAT3 activation in human Hep3B cells after 12 hrs by luciferase assay
J Nat Prod 78: 971-6 (2015)
Article DOI: 10.1021/np500803e
BindingDB Entry DOI: 10.7270/Q22B90SD