BDBM50090552 1-[7-Chloro-3-(3,5-dimethyl-phenyl)-2-oxo-4-(2-piperidin-2-yl-ethoxy)-1,2-dihydro-quinolin-6-yl]-3-pyrazin-2-yl-urea::CHEMBL50283
SMILES: Cc1cc(C)cc(c1)-c1c(OCCC2CCCCN2)c2cc(NC(=O)Nc3cnccn3)c(Cl)cc2[nH]c1=O
InChI Key: InChIKey=ADRCRSPDCZNNQH-UHFFFAOYSA-N
Data: 2 IC50
Activity Spreadsheet -- Enzyme Inhibition Constant Data from BindingDB
Found 2 hits for monomerid = 50090552
Trg + Lig
Ki
nM
ΔG°
kcal/mole
IC50
nM
Kd
nM
EC50/IC50
nM
koff
s-1
kon
M-1s-1
pHTemp
°C
Gonadotropin-releasing hormone receptor
(Rattus norvegicus)
BDBM50090552
(1-[7-Chloro-3-(3,5-dimethyl-phenyl)-2-oxo-4-(2-pip...)
Show SMILES Cc1cc(C)cc(c1)-c1c(OCCC2CCCCN2)c2cc(NC(=O)Nc3cnccn3)c(Cl)cc2[nH]c1=O
Show InChI InChI=1S/C29H31ClN6O3/c1-17-11-18(2)13-19(12-17)26-27(39-10-6-20-5-3-4-7-32-20)21-14-24(22(30)15-23(21)34-28(26)37)35-29(38)36-25-16-31-8-9-33-25/h8-9,11-16,20,32H,3-7,10H2,1-2H3,(H,34,37)(H2,33,35,36,38)
n/an/a 56n/an/an/an/an/an/a
Merck Research Laboratories
Curated by ChEMBL
Assay Description
Compound was evaluated for its antagonism in rat primary pituitary cell assay (rLH)
Bioorg Med Chem Lett 10: 1723-7 (2000)
BindingDB Entry DOI: 10.7270/Q26W99B2
Gonadotropin-releasing hormone receptor
(Rattus norvegicus)
BDBM50090552
(1-[7-Chloro-3-(3,5-dimethyl-phenyl)-2-oxo-4-(2-pip...)
Show SMILES Cc1cc(C)cc(c1)-c1c(OCCC2CCCCN2)c2cc(NC(=O)Nc3cnccn3)c(Cl)cc2[nH]c1=O
Show InChI InChI=1S/C29H31ClN6O3/c1-17-11-18(2)13-19(12-17)26-27(39-10-6-20-5-3-4-7-32-20)21-14-24(22(30)15-23(21)34-28(26)37)35-29(38)36-25-16-31-8-9-33-25/h8-9,11-16,20,32H,3-7,10H2,1-2H3,(H,34,37)(H2,33,35,36,38)
n/an/a 0.300n/an/an/an/an/an/a
Merck Research Laboratories
Curated by ChEMBL
Assay Description
Antagonist activity against Gonadotropin-releasing hormone receptor (GnRHr) in rat pituitary cells
Bioorg Med Chem Lett 10: 1723-7 (2000)
BindingDB Entry DOI: 10.7270/Q26W99B2