BDBM50090555 1-[7-Chloro-3-(3,5-dimethyl-phenyl)-2-oxo-4-(2-piperidin-2-yl-ethoxy)-1,2-dihydro-quinolin-6-yl]-3-pyrimidin-4-yl-urea::CHEMBL50433
SMILES: Cc1cc(C)cc(c1)-c1c(OCCC2CCCCN2)c2cc(NC(=O)Nc3ccncn3)c(Cl)cc2[nH]c1=O
InChI Key: InChIKey=IDBKGTFOVFGQBA-UHFFFAOYSA-N
Data: 4 IC50
Activity Spreadsheet -- Enzyme Inhibition Constant Data from BindingDB
Found 4 hits for monomerid = 50090555
Trg + Lig
Ki
nM
ΔG°
kcal/mole
IC50
nM
Kd
nM
EC50/IC50
nM
koff
s-1
kon
M-1s-1
pHTemp
°C
Gonadotropin-releasing hormone receptor
(Rattus norvegicus)
BDBM50090555
(1-[7-Chloro-3-(3,5-dimethyl-phenyl)-2-oxo-4-(2-pip...)
Show SMILES Cc1cc(C)cc(c1)-c1c(OCCC2CCCCN2)c2cc(NC(=O)Nc3ccncn3)c(Cl)cc2[nH]c1=O
Show InChI InChI=1S/C29H31ClN6O3/c1-17-11-18(2)13-19(12-17)26-27(39-10-7-20-5-3-4-8-32-20)21-14-24(22(30)15-23(21)34-28(26)37)35-29(38)36-25-6-9-31-16-33-25/h6,9,11-16,20,32H,3-5,7-8,10H2,1-2H3,(H,34,37)(H2,31,33,35,36,38)
n/an/a 0.400n/an/an/an/an/an/a
Merck Research Laboratories
Curated by ChEMBL
Assay Description
Compound was evaluated for its inhibitory activity against rat pituitary Gonadotropin-releasing hormone receptor
Bioorg Med Chem Lett 10: 1723-7 (2000)
BindingDB Entry DOI: 10.7270/Q26W99B2
Gonadotropin-releasing hormone receptor
(Rattus norvegicus)
BDBM50090555
(1-[7-Chloro-3-(3,5-dimethyl-phenyl)-2-oxo-4-(2-pip...)
Show SMILES Cc1cc(C)cc(c1)-c1c(OCCC2CCCCN2)c2cc(NC(=O)Nc3ccncn3)c(Cl)cc2[nH]c1=O
Show InChI InChI=1S/C29H31ClN6O3/c1-17-11-18(2)13-19(12-17)26-27(39-10-7-20-5-3-4-8-32-20)21-14-24(22(30)15-23(21)34-28(26)37)35-29(38)36-25-6-9-31-16-33-25/h6,9,11-16,20,32H,3-5,7-8,10H2,1-2H3,(H,34,37)(H2,31,33,35,36,38)
n/an/a 52n/an/an/an/an/an/a
Merck Research Laboratories
Curated by ChEMBL
Assay Description
Compound was evaluated for its antagonism in rat primary pituitary cell assay (rLH)
Bioorg Med Chem Lett 10: 1723-7 (2000)
BindingDB Entry DOI: 10.7270/Q26W99B2
Gonadotropin-releasing hormone receptor
(Rattus norvegicus)
BDBM50090555
(1-[7-Chloro-3-(3,5-dimethyl-phenyl)-2-oxo-4-(2-pip...)
Show SMILES Cc1cc(C)cc(c1)-c1c(OCCC2CCCCN2)c2cc(NC(=O)Nc3ccncn3)c(Cl)cc2[nH]c1=O
Show InChI InChI=1S/C29H31ClN6O3/c1-17-11-18(2)13-19(12-17)26-27(39-10-7-20-5-3-4-8-32-20)21-14-24(22(30)15-23(21)34-28(26)37)35-29(38)36-25-6-9-31-16-33-25/h6,9,11-16,20,32H,3-5,7-8,10H2,1-2H3,(H,34,37)(H2,31,33,35,36,38)
n/an/a 235n/an/an/an/an/an/a
Merck Research Laboratories
Curated by ChEMBL
Assay Description
Compound was evaluated for its antagonism in rat primary pituitary cell assay (rLH)
Bioorg Med Chem Lett 10: 1723-7 (2000)
BindingDB Entry DOI: 10.7270/Q26W99B2
Gonadotropin-releasing hormone receptor
(Rattus norvegicus)
BDBM50090555
(1-[7-Chloro-3-(3,5-dimethyl-phenyl)-2-oxo-4-(2-pip...)
Show SMILES Cc1cc(C)cc(c1)-c1c(OCCC2CCCCN2)c2cc(NC(=O)Nc3ccncn3)c(Cl)cc2[nH]c1=O
Show InChI InChI=1S/C29H31ClN6O3/c1-17-11-18(2)13-19(12-17)26-27(39-10-7-20-5-3-4-8-32-20)21-14-24(22(30)15-23(21)34-28(26)37)35-29(38)36-25-6-9-31-16-33-25/h6,9,11-16,20,32H,3-5,7-8,10H2,1-2H3,(H,34,37)(H2,31,33,35,36,38)
n/an/a 0.600n/an/an/an/an/an/a
Merck Research Laboratories
Curated by ChEMBL
Assay Description
Compound was evaluated for its antagonism in rat primary pituitary cell assay (rLH)
Bioorg Med Chem Lett 10: 1723-7 (2000)
BindingDB Entry DOI: 10.7270/Q26W99B2