BDBM50090806 2-[1-(4-Chloro-benzoyl)-5-methoxy-2-methyl-1H-indol-3-yl]-1-morpholin-4-yl-ethanone::CHEMBL72631
SMILES: COc1ccc2n(C(=O)c3ccc(Cl)cc3)c(C)c(CC(=O)N3CCOCC3)c2c1
InChI Key: InChIKey=BJSDNVVWJYDOLK-UHFFFAOYSA-N
Data: 2 KI  2 IC50
Activity Spreadsheet -- Enzyme Inhibition Constant Data from BindingDB
Found 4 hits for monomerid = 50090806
Trg + Lig
Ki
nM
ΔG°
kcal/mole
IC50
nM
Kd
nM
EC50/IC50
nM
koff
s-1
kon
M-1s-1
pHTemp
°C
Cannabinoid receptor 2
(Homo sapiens (Human))
BDBM50090806
(2-[1-(4-Chloro-benzoyl)-5-methoxy-2-methyl-1H-indo...)
Show SMILES COc1ccc2n(C(=O)c3ccc(Cl)cc3)c(C)c(CC(=O)N3CCOCC3)c2c1
Show InChI InChI=1S/C23H23ClN2O4/c1-15-19(14-22(27)25-9-11-30-12-10-25)20-13-18(29-2)7-8-21(20)26(15)23(28)16-3-5-17(24)6-4-16/h3-8,13H,9-12,14H2,1-2H3
Reactome pathway
435n/an/an/an/an/an/an/an/a
TBA
Curated by ChEMBL
Assay Description
Evaluated for binding affinity against recombinant human peripheral cannabinoid receptor 2
Bioorg Med Chem Lett 6: 2263-2268 (1996)
Article DOI: 10.1016/0960-894X(96)00426-X
BindingDB Entry DOI: 10.7270/Q2MS3SRN
Cannabinoid receptor 1
(Homo sapiens (Human))
BDBM50090806
(2-[1-(4-Chloro-benzoyl)-5-methoxy-2-methyl-1H-indo...)
Show SMILES COc1ccc2n(C(=O)c3ccc(Cl)cc3)c(C)c(CC(=O)N3CCOCC3)c2c1
Show InChI InChI=1S/C23H23ClN2O4/c1-15-19(14-22(27)25-9-11-30-12-10-25)20-13-18(29-2)7-8-21(20)26(15)23(28)16-3-5-17(24)6-4-16/h3-8,13H,9-12,14H2,1-2H3
NCI pathway
Reactome pathway
>2.00E+4n/an/an/an/an/an/an/an/a
TBA
Curated by ChEMBL
Assay Description
Evaluated for binding affinity against recombinant human central cannabinoid receptor 1
Bioorg Med Chem Lett 6: 2263-2268 (1996)
Article DOI: 10.1016/0960-894X(96)00426-X
BindingDB Entry DOI: 10.7270/Q2MS3SRN
Prostaglandin G/H synthase (cyclooxygenase)
(Ovis aries (Sheep))
BDBM50090806
(2-[1-(4-Chloro-benzoyl)-5-methoxy-2-methyl-1H-indo...)
Show SMILES COc1ccc2n(C(=O)c3ccc(Cl)cc3)c(C)c(CC(=O)N3CCOCC3)c2c1
Show InChI InChI=1S/C23H23ClN2O4/c1-15-19(14-22(27)25-9-11-30-12-10-25)20-13-18(29-2)7-8-21(20)26(15)23(28)16-3-5-17(24)6-4-16/h3-8,13H,9-12,14H2,1-2H3
n/an/a>6.60E+4n/an/an/an/an/an/a
Vanderbilt University School of Medicine
Curated by ChEMBL
Assay Description
In vitro inhibitory activity against ovine Prostaglandin G/H synthase 1 (44 nM) using [14C]AA (50 uM) was determined
J Med Chem 43: 2860-70 (2000)
BindingDB Entry DOI: 10.7270/Q22806VP
Cyclooxygenase
(Homo sapiens (Human))
BDBM50090806
(2-[1-(4-Chloro-benzoyl)-5-methoxy-2-methyl-1H-indo...)
Show SMILES COc1ccc2n(C(=O)c3ccc(Cl)cc3)c(C)c(CC(=O)N3CCOCC3)c2c1
Show InChI InChI=1S/C23H23ClN2O4/c1-15-19(14-22(27)25-9-11-30-12-10-25)20-13-18(29-2)7-8-21(20)26(15)23(28)16-3-5-17(24)6-4-16/h3-8,13H,9-12,14H2,1-2H3
NCI pathway
Reactome pathway
n/an/a>3.30E+4n/an/an/an/an/an/a
Vanderbilt University School of Medicine
Curated by ChEMBL
Assay Description
In vitro inhibitory activity against human Prostaglandin G/H synthase 2 (66 nM) using [14C]-AA (50 uM) was determined
J Med Chem 43: 2860-70 (2000)
BindingDB Entry DOI: 10.7270/Q22806VP