BDBM50090953 CHEMBL3582024
SMILES: CCOC(=O)C(CC)(CC)NC(=O)c1ccc(C2CCCC2)c(OCC2CC2)n1
InChI Key: InChIKey=VSSHUDIXCXMKSI-UHFFFAOYSA-N
Data: 2 KI  2 EC50
Activity Spreadsheet -- Enzyme Inhibition Constant Data from BindingDB
Found 4 hits for monomerid = 50090953
Trg + Lig
Ki
nM
ΔG°
kcal/mole
IC50
nM
Kd
nM
EC50/IC50
nM
koff
s-1
kon
M-1s-1
pHTemp
°C
Cannabinoid receptor 2
(Homo sapiens (Human))
BDBM50090953
(CHEMBL3582024)
Show SMILES CCOC(=O)C(CC)(CC)NC(=O)c1ccc(C2CCCC2)c(OCC2CC2)n1
Show InChI InChI=1S/C23H34N2O4/c1-4-23(5-2,22(27)28-6-3)25-20(26)19-14-13-18(17-9-7-8-10-17)21(24-19)29-15-16-11-12-16/h13-14,16-17H,4-12,15H2,1-3H3,(H,25,26)
Reactome pathway
16n/an/an/an/an/an/an/an/a
Institute of Pharmaceutical Sciences
Curated by ChEMBL
Assay Description
Displacement of [3H]CP-55,940 from human CB2 receptor expressed in CHO cell membranes
J Med Chem 58: 4266-77 (2015)
Article DOI: 10.1021/acs.jmedchem.5b00283
BindingDB Entry DOI: 10.7270/Q2542QBG
Cannabinoid receptor 2
(MOUSE)
BDBM50090953
(CHEMBL3582024)
Show SMILES CCOC(=O)C(CC)(CC)NC(=O)c1ccc(C2CCCC2)c(OCC2CC2)n1
Show InChI InChI=1S/C23H34N2O4/c1-4-23(5-2,22(27)28-6-3)25-20(26)19-14-13-18(17-9-7-8-10-17)21(24-19)29-15-16-11-12-16/h13-14,16-17H,4-12,15H2,1-3H3,(H,25,26)
Reactome pathway
39n/an/an/an/an/an/an/an/a
Institute of Pharmaceutical Sciences
Curated by ChEMBL
Assay Description
Displacement of [3H]CP-55,940 from mouse CB2 receptor expressed in CHO cell membranes
J Med Chem 58: 4266-77 (2015)
Article DOI: 10.1021/acs.jmedchem.5b00283
BindingDB Entry DOI: 10.7270/Q2542QBG
Cannabinoid receptor 2
(Homo sapiens (Human))
BDBM50090953
(CHEMBL3582024)
Show SMILES CCOC(=O)C(CC)(CC)NC(=O)c1ccc(C2CCCC2)c(OCC2CC2)n1
Show InChI InChI=1S/C23H34N2O4/c1-4-23(5-2,22(27)28-6-3)25-20(26)19-14-13-18(17-9-7-8-10-17)21(24-19)29-15-16-11-12-16/h13-14,16-17H,4-12,15H2,1-3H3,(H,25,26)
Reactome pathway
n/an/an/an/a>1.00E+4n/an/an/an/a
Institute of Pharmaceutical Sciences
Curated by ChEMBL
Assay Description
Activity at human CB1 receptor expressed in CHO cells assessed as cAMP accumulation incubated for 30 mins by time-resolved FRET assay
J Med Chem 58: 4266-77 (2015)
Article DOI: 10.1021/acs.jmedchem.5b00283
BindingDB Entry DOI: 10.7270/Q2542QBG
Cannabinoid receptor 2
(Homo sapiens (Human))
BDBM50090953
(CHEMBL3582024)
Show SMILES CCOC(=O)C(CC)(CC)NC(=O)c1ccc(C2CCCC2)c(OCC2CC2)n1
Show InChI InChI=1S/C23H34N2O4/c1-4-23(5-2,22(27)28-6-3)25-20(26)19-14-13-18(17-9-7-8-10-17)21(24-19)29-15-16-11-12-16/h13-14,16-17H,4-12,15H2,1-3H3,(H,25,26)
Reactome pathway
n/an/an/an/a 2.90n/an/an/an/a
Institute of Pharmaceutical Sciences
Curated by ChEMBL
Assay Description
Activity at human CB2 receptor expressed in CHO cells assessed as cAMP accumulation incubated for 30 mins by time-resolved FRET assay
J Med Chem 58: 4266-77 (2015)
Article DOI: 10.1021/acs.jmedchem.5b00283
BindingDB Entry DOI: 10.7270/Q2542QBG