BDBM50090957 CHEMBL3582028
SMILES: CC(C)(Cc1nnc(o1)-c1ccc(F)cc1)NC(=O)c1ccc(C2CCCC2)c(OCC2CC2)n1
InChI Key: InChIKey=FXPPWHQZVZRKJL-UHFFFAOYSA-N
Data: 2 KI  2 EC50
Activity Spreadsheet -- Enzyme Inhibition Constant Data from BindingDB
Found 4 hits for monomerid = 50090957
Trg + Lig
Ki
nM
ΔG°
kcal/mole
IC50
nM
Kd
nM
EC50/IC50
nM
koff
s-1
kon
M-1s-1
pHTemp
°C
Cannabinoid receptor 2
(MOUSE)
BDBM50090957
(CHEMBL3582028)
Show SMILES CC(C)(Cc1nnc(o1)-c1ccc(F)cc1)NC(=O)c1ccc(C2CCCC2)c(OCC2CC2)n1
Show InChI InChI=1S/C27H31FN4O3/c1-27(2,15-23-31-32-25(35-23)19-9-11-20(28)12-10-19)30-24(33)22-14-13-21(18-5-3-4-6-18)26(29-22)34-16-17-7-8-17/h9-14,17-18H,3-8,15-16H2,1-2H3,(H,30,33)
Reactome pathway
403n/an/an/an/an/an/an/an/a
Institute of Pharmaceutical Sciences
Curated by ChEMBL
Assay Description
Displacement of [3H]CP-55,940 from mouse CB2 receptor expressed in CHO cell membranes
J Med Chem 58: 4266-77 (2015)
Article DOI: 10.1021/acs.jmedchem.5b00283
BindingDB Entry DOI: 10.7270/Q2542QBG
Cannabinoid receptor 2
(Homo sapiens (Human))
BDBM50090957
(CHEMBL3582028)
Show SMILES CC(C)(Cc1nnc(o1)-c1ccc(F)cc1)NC(=O)c1ccc(C2CCCC2)c(OCC2CC2)n1
Show InChI InChI=1S/C27H31FN4O3/c1-27(2,15-23-31-32-25(35-23)19-9-11-20(28)12-10-19)30-24(33)22-14-13-21(18-5-3-4-6-18)26(29-22)34-16-17-7-8-17/h9-14,17-18H,3-8,15-16H2,1-2H3,(H,30,33)
Reactome pathway
416n/an/an/an/an/an/an/an/a
Institute of Pharmaceutical Sciences
Curated by ChEMBL
Assay Description
Displacement of [3H]CP-55,940 from human CB2 receptor expressed in CHO cell membranes
J Med Chem 58: 4266-77 (2015)
Article DOI: 10.1021/acs.jmedchem.5b00283
BindingDB Entry DOI: 10.7270/Q2542QBG
Cannabinoid receptor 2
(Homo sapiens (Human))
BDBM50090957
(CHEMBL3582028)
Show SMILES CC(C)(Cc1nnc(o1)-c1ccc(F)cc1)NC(=O)c1ccc(C2CCCC2)c(OCC2CC2)n1
Show InChI InChI=1S/C27H31FN4O3/c1-27(2,15-23-31-32-25(35-23)19-9-11-20(28)12-10-19)30-24(33)22-14-13-21(18-5-3-4-6-18)26(29-22)34-16-17-7-8-17/h9-14,17-18H,3-8,15-16H2,1-2H3,(H,30,33)
Reactome pathway
n/an/an/an/a>1.00E+4n/an/an/an/a
Institute of Pharmaceutical Sciences
Curated by ChEMBL
Assay Description
Activity at human CB1 receptor expressed in CHO cells assessed as cAMP accumulation incubated for 30 mins by time-resolved FRET assay
J Med Chem 58: 4266-77 (2015)
Article DOI: 10.1021/acs.jmedchem.5b00283
BindingDB Entry DOI: 10.7270/Q2542QBG
Cannabinoid receptor 2
(Homo sapiens (Human))
BDBM50090957
(CHEMBL3582028)
Show SMILES CC(C)(Cc1nnc(o1)-c1ccc(F)cc1)NC(=O)c1ccc(C2CCCC2)c(OCC2CC2)n1
Show InChI InChI=1S/C27H31FN4O3/c1-27(2,15-23-31-32-25(35-23)19-9-11-20(28)12-10-19)30-24(33)22-14-13-21(18-5-3-4-6-18)26(29-22)34-16-17-7-8-17/h9-14,17-18H,3-8,15-16H2,1-2H3,(H,30,33)
Reactome pathway
n/an/an/an/a 2.76E+3n/an/an/an/a
Institute of Pharmaceutical Sciences
Curated by ChEMBL
Assay Description
Activity at human CB2 receptor expressed in CHO cells assessed as cAMP accumulation incubated for 30 mins by time-resolved FRET assay
J Med Chem 58: 4266-77 (2015)
Article DOI: 10.1021/acs.jmedchem.5b00283
BindingDB Entry DOI: 10.7270/Q2542QBG