BDBM50090969 CHEMBL3582034
SMILES: Cn1cnc(c1)-c1cc2nccc(Oc3ccc(NC(=O)c4ncn(c4C(F)(F)F)-c4ccccc4)cc3F)c2s1
InChI Key: InChIKey=IFZYMCHDYMUGNV-UHFFFAOYSA-N
Data: 2 IC50
Activity Spreadsheet -- Enzyme Inhibition Constant Data from BindingDB
Found 2 hits for monomerid = 50090969
Trg + Lig
Ki
nM
ΔG°
kcal/mole
IC50
nM
Kd
nM
EC50/IC50
nM
koff
s-1
kon
M-1s-1
pHTemp
°C
Macrophage-stimulating protein receptor
(Homo sapiens (Human))
BDBM50090969
(CHEMBL3582034)
Show SMILES Cn1cnc(c1)-c1cc2nccc(Oc3ccc(NC(=O)c4ncn(c4C(F)(F)F)-c4ccccc4)cc3F)c2s1
Show InChI InChI=1S/C28H18F4N6O2S/c1-37-13-20(34-14-37)23-12-19-25(41-23)22(9-10-33-19)40-21-8-7-16(11-18(21)29)36-27(39)24-26(28(30,31)32)38(15-35-24)17-5-3-2-4-6-17/h2-15H,1H3,(H,36,39)
n/an/a 13n/an/an/an/an/an/a
ChemRF Laboratories
Curated by ChEMBL
Assay Description
Inhibition of RON (unknown origin) transfected in 293T cells assessed as autophosporylated level by ELISA
Bioorg Med Chem Lett 25: 2527-31 (2015)
Article DOI: 10.1016/j.bmcl.2015.04.056
BindingDB Entry DOI: 10.7270/Q21C1ZMR
Hepatocyte growth factor receptor
(Homo sapiens (Human))
BDBM50090969
(CHEMBL3582034)
Show SMILES Cn1cnc(c1)-c1cc2nccc(Oc3ccc(NC(=O)c4ncn(c4C(F)(F)F)-c4ccccc4)cc3F)c2s1
Show InChI InChI=1S/C28H18F4N6O2S/c1-37-13-20(34-14-37)23-12-19-25(41-23)22(9-10-33-19)40-21-8-7-16(11-18(21)29)36-27(39)24-26(28(30,31)32)38(15-35-24)17-5-3-2-4-6-17/h2-15H,1H3,(H,36,39)
n/an/a 2.40E+3n/an/an/an/an/an/a
ChemRF Laboratories
Curated by ChEMBL
Assay Description
Inhibition of phosphorylation of c-Met in human MKN45 cells
Bioorg Med Chem Lett 25: 2527-31 (2015)
Article DOI: 10.1016/j.bmcl.2015.04.056
BindingDB Entry DOI: 10.7270/Q21C1ZMR