BDBM50091063 CHEMBL3582165
SMILES: COc1cc(OC)c2C[C@H](OC(=O)\C=C\c3ccc(OC)c(OC)c3)[C@H](Oc2c1)c1cc(OC)c(OC)c(OC)c1
InChI Key: InChIKey=GJQYFVVJUBJBIA-IPGJECJKSA-N
Data: 1 IC50
Activity Spreadsheet -- Enzyme Inhibition Constant Data from BindingDB
Found 1 hit for monomerid = 50091063
Trg + Lig
Ki
nM
ΔG°
kcal/mole
IC50
nM
Kd
nM
EC50/IC50
nM
koff
s-1
kon
M-1s-1
pHTemp
°C
P-glycoprotein 1
(Homo sapiens (Human))
BDBM50091063
(CHEMBL3582165)
Show SMILES COc1cc(OC)c2C[C@H](OC(=O)\C=C\c3ccc(OC)c(OC)c3)[C@H](Oc2c1)c1cc(OC)c(OC)c(OC)c1 |r|
Show InChI InChI=1S/C31H34O10/c1-33-20-15-23(35-3)21-17-28(40-29(32)11-9-18-8-10-22(34-2)25(12-18)36-4)30(41-24(21)16-20)19-13-26(37-5)31(39-7)27(14-19)38-6/h8-16,28,30H,17H2,1-7H3/b11-9+/t28-,30+/m0/s1
n/an/a 12n/an/an/an/an/an/a
The Hong Kong Polytechnic University
Curated by ChEMBL
Assay Description
Modulation of P-gp (unknown origin) transfected in human MDA435/LCC6MDR cells assessed as reversible of paclitaxel resistance measured as IC50 for pa...
J Med Chem 58: 4529-49 (2015)
Article DOI: 10.1021/acs.jmedchem.5b00085
BindingDB Entry DOI: 10.7270/Q2N29ZP5