BDBM50091148 CHEMBL106769::[3-(2-Chloro-phenothiazin-10-yl)-propyl]-(7-methoxy-2-oxo-2H-chromen-4-ylmethyl)-dimethyl-ammonium (OFK014)
SMILES: COc1ccc2c(C[N+](C)(C)CCCN3c4ccccc4Sc4ccc(Cl)cc34)cc(=O)oc2c1
InChI Key: InChIKey=KWKDENFXTSYISJ-UHFFFAOYSA-N
Data: 1 KI  1 IC50
Activity Spreadsheet -- Enzyme Inhibition Constant Data from BindingDB
Found 2 hits for monomerid = 50091148
Trg + Lig
Ki
nM
ΔG°
kcal/mole
IC50
nM
Kd
nM
EC50/IC50
nM
koff
s-1
kon
M-1s-1
pHTemp
°C
Trypanothione reductase
(Trypanosoma cruzi)
BDBM50091148
(CHEMBL106769 | [3-(2-Chloro-phenothiazin-10-yl)-pr...)
Show SMILES COc1ccc2c(C[N+](C)(C)CCCN3c4ccccc4Sc4ccc(Cl)cc34)cc(=O)oc2c1
Show InChI InChI=1S/C28H28ClN2O3S/c1-31(2,18-19-15-28(32)34-25-17-21(33-3)10-11-22(19)25)14-6-13-30-23-7-4-5-8-26(23)35-27-12-9-20(29)16-24(27)30/h4-5,7-12,15-17H,6,13-14,18H2,1-3H3/q+1
560n/an/an/an/an/an/an/an/a
University of Manchester
Curated by ChEMBL
Assay Description
Inhibitory activity against Trypanosoma cruzi trypanothione reductase
J Med Chem 43: 3148-56 (2000)
BindingDB Entry DOI: 10.7270/Q2R78FXC
Trypanothione reductase
(Trypanosoma cruzi)
BDBM50091148
(CHEMBL106769 | [3-(2-Chloro-phenothiazin-10-yl)-pr...)
Show SMILES COc1ccc2c(C[N+](C)(C)CCCN3c4ccccc4Sc4ccc(Cl)cc34)cc(=O)oc2c1
Show InChI InChI=1S/C28H28ClN2O3S/c1-31(2,18-19-15-28(32)34-25-17-21(33-3)10-11-22(19)25)14-6-13-30-23-7-4-5-8-26(23)35-27-12-9-20(29)16-24(27)30/h4-5,7-12,15-17H,6,13-14,18H2,1-3H3/q+1
n/an/a 2.95E+3n/an/an/an/an/an/a
University of Manchester
Curated by ChEMBL
Assay Description
Inhibitory activity against Trypanosoma cruzi trypanothione reductase
J Med Chem 43: 3148-56 (2000)
BindingDB Entry DOI: 10.7270/Q2R78FXC