BDBM50091150 CHEMBL323540::[3-(2-Chloro-phenothiazin-10-yl)-propyl]-dimethyl-(4-methyl-benzyl)-ammonium (OFK001)
SMILES: Cc1ccc(C[N+](C)(C)CCCN2c3ccccc3Sc3ccc(Cl)cc23)cc1
InChI Key: InChIKey=SUMBEDJMEJLPLO-UHFFFAOYSA-N
Data: 1 KI  1 IC50
Activity Spreadsheet -- Enzyme Inhibition Constant Data from BindingDB
Found 2 hits for monomerid = 50091150
Trg + Lig
Ki
nM
ΔG°
kcal/mole
IC50
nM
Kd
nM
EC50/IC50
nM
koff
s-1
kon
M-1s-1
pHTemp
°C
Trypanothione reductase
(Trypanosoma cruzi)
BDBM50091150
(CHEMBL323540 | [3-(2-Chloro-phenothiazin-10-yl)-pr...)
Show SMILES Cc1ccc(C[N+](C)(C)CCCN2c3ccccc3Sc3ccc(Cl)cc23)cc1
Show InChI InChI=1S/C25H28ClN2S/c1-19-9-11-20(12-10-19)18-28(2,3)16-6-15-27-22-7-4-5-8-24(22)29-25-14-13-21(26)17-23(25)27/h4-5,7-14,17H,6,15-16,18H2,1-3H3/q+1
1.80E+3n/an/an/an/an/an/an/an/a
University of Manchester
Curated by ChEMBL
Assay Description
Inhibitory activity against Trypanosoma cruzi trypanothione reductase
J Med Chem 43: 3148-56 (2000)
BindingDB Entry DOI: 10.7270/Q2R78FXC
Trypanothione reductase
(Trypanosoma cruzi)
BDBM50091150
(CHEMBL323540 | [3-(2-Chloro-phenothiazin-10-yl)-pr...)
Show SMILES Cc1ccc(C[N+](C)(C)CCCN2c3ccccc3Sc3ccc(Cl)cc23)cc1
Show InChI InChI=1S/C25H28ClN2S/c1-19-9-11-20(12-10-19)18-28(2,3)16-6-15-27-22-7-4-5-8-24(22)29-25-14-13-21(26)17-23(25)27/h4-5,7-14,17H,6,15-16,18H2,1-3H3/q+1
n/an/a 1.08E+4n/an/an/an/an/an/a
University of Manchester
Curated by ChEMBL
Assay Description
Inhibitory activity against Trypanosoma cruzi trypanothione reductase
J Med Chem 43: 3148-56 (2000)
BindingDB Entry DOI: 10.7270/Q2R78FXC