BDBM50091159 CHEMBL326458::[2-(4-Chloro-3-methyl-phenyl)-2-oxo-ethyl]-[3-(2-chloro-phenothiazin-10-yl)-propyl]-dimethyl-ammonium (OFK019)
SMILES: Cc1cc(ccc1Cl)C(=O)C[N+](C)(C)CCCN1c2ccccc2Sc2ccc(Cl)cc12
InChI Key: InChIKey=SWWZIOLAAJNULB-UHFFFAOYSA-N
Data: 1 KI  1 IC50
Activity Spreadsheet -- Enzyme Inhibition Constant Data from BindingDB
Found 2 hits for monomerid = 50091159
Trg + Lig
Ki
nM
ΔG°
kcal/mole
IC50
nM
Kd
nM
EC50/IC50
nM
koff
s-1
kon
M-1s-1
pHTemp
°C
Trypanothione reductase
(Trypanosoma cruzi)
BDBM50091159
(CHEMBL326458 | [2-(4-Chloro-3-methyl-phenyl)-2-oxo...)
Show SMILES Cc1cc(ccc1Cl)C(=O)C[N+](C)(C)CCCN1c2ccccc2Sc2ccc(Cl)cc12
Show InChI InChI=1S/C26H27Cl2N2OS/c1-18-15-19(9-11-21(18)28)24(31)17-30(2,3)14-6-13-29-22-7-4-5-8-25(22)32-26-12-10-20(27)16-23(26)29/h4-5,7-12,15-16H,6,13-14,17H2,1-3H3/q+1
1.43E+3n/an/an/an/an/an/an/an/a
University of Manchester
Curated by ChEMBL
Assay Description
Inhibitory activity against Trypanosoma cruzi trypanothione reductase
J Med Chem 43: 3148-56 (2000)
BindingDB Entry DOI: 10.7270/Q2R78FXC
Trypanothione reductase
(Trypanosoma cruzi)
BDBM50091159
(CHEMBL326458 | [2-(4-Chloro-3-methyl-phenyl)-2-oxo...)
Show SMILES Cc1cc(ccc1Cl)C(=O)C[N+](C)(C)CCCN1c2ccccc2Sc2ccc(Cl)cc12
Show InChI InChI=1S/C26H27Cl2N2OS/c1-18-15-19(9-11-21(18)28)24(31)17-30(2,3)14-6-13-29-22-7-4-5-8-25(22)32-26-12-10-20(27)16-23(26)29/h4-5,7-12,15-16H,6,13-14,17H2,1-3H3/q+1
n/an/a 8.60E+3n/an/an/an/an/an/a
University of Manchester
Curated by ChEMBL
Assay Description
Inhibitory activity against Trypanosoma cruzi trypanothione reductase
J Med Chem 43: 3148-56 (2000)
BindingDB Entry DOI: 10.7270/Q2R78FXC