BDBM50091231 CHEMBL3582182
SMILES: COc1cc(OC)c2C(=O)[C@H](OC(=O)c3ccc(F)c(NC(=O)\C=C\c4ccc(OC)c(OC)c4)c3)[C@H](Oc2c1)c1cc(OC)c(OC)c(OC)c1
InChI Key: InChIKey=LIKBOJNXLDAXPE-DZSXEVGWSA-N
Data: 1 IC50
Activity Spreadsheet -- Enzyme Inhibition Constant Data from BindingDB
Found 1 hit for monomerid = 50091231
Trg + Lig
Ki
nM
ΔG°
kcal/mole
IC50
nM
Kd
nM
EC50/IC50
nM
koff
s-1
kon
M-1s-1
pHTemp
°C
P-glycoprotein 1
(Homo sapiens (Human))
BDBM50091231
(CHEMBL3582182)
Show SMILES COc1cc(OC)c2C(=O)[C@H](OC(=O)c3ccc(F)c(NC(=O)\C=C\c4ccc(OC)c(OC)c4)c3)[C@H](Oc2c1)c1cc(OC)c(OC)c(OC)c1 |r|
Show InChI InChI=1S/C22H37NO3/c1-20(26)10-11-21(2)15(13-20)6-7-16-17(21)8-9-22(3)18(16)5-4-12-23(22)19(25)14-24/h15-18,24,26H,4-14H2,1-3H3/t15-,16?,17?,18?,20+,21-,22-/m0/s1
n/an/a 14n/an/an/an/an/an/a
The Hong Kong Polytechnic University
Curated by ChEMBL
Assay Description
Modulation of P-gp (unknown origin) transfected in human MDA435/LCC6MDR cells assessed as reversible of paclitaxel resistance measured as IC50 for pa...
J Med Chem 58: 4529-49 (2015)
Article DOI: 10.1021/acs.jmedchem.5b00085
BindingDB Entry DOI: 10.7270/Q2N29ZP5