BDBM50091287 CHEMBL3582228
SMILES: C(N1CCCCC1)c1ccc(cc1)-c1cnc2[nH]c3cnc(cc3c2c1)-c1cccnc1
InChI Key: InChIKey=MJGVCCPVNPTNCM-UHFFFAOYSA-N
Data: 2 IC50  1 EC50
Activity Spreadsheet -- Enzyme Inhibition Constant Data from BindingDB
Found 3 hits for monomerid = 50091287
Trg + Lig
Ki
nM
ΔG°
kcal/mole
IC50
nM
Kd
nM
EC50/IC50
nM
koff
s-1
kon
M-1s-1
pHTemp
°C
Acetylcholinesterase
(Homo sapiens (Human))
BDBM50091287
(CHEMBL3582228)
Show SMILES C(N1CCCCC1)c1ccc(cc1)-c1cnc2[nH]c3cnc(cc3c2c1)-c1cccnc1
Show InChI InChI=1S/C27H25N5/c1-2-11-32(12-3-1)18-19-6-8-20(9-7-19)22-13-24-23-14-25(21-5-4-10-28-15-21)29-17-26(23)31-27(24)30-16-22/h4-10,13-17H,1-3,11-12,18H2,(H,30,31)
NCI pathway
Reactome pathway
n/an/a 493n/an/an/an/an/an/a
Argenta Discovery Ltd.
Curated by ChEMBL
Assay Description
Inhibition of human acetylcholine esterase by horseradish peroxidase-coupled fluorescence assay
J Med Chem 58: 5053-74 (2015)
Article DOI: 10.1021/acs.jmedchem.5b00464
BindingDB Entry DOI: 10.7270/Q2HD7XC5
Serine/threonine-protein kinase Chk1
(Homo sapiens (Human))
BDBM50091287
(CHEMBL3582228)
Show SMILES C(N1CCCCC1)c1ccc(cc1)-c1cnc2[nH]c3cnc(cc3c2c1)-c1cccnc1
Show InChI InChI=1S/C27H25N5/c1-2-11-32(12-3-1)18-19-6-8-20(9-7-19)22-13-24-23-14-25(21-5-4-10-28-15-21)29-17-26(23)31-27(24)30-16-22/h4-10,13-17H,1-3,11-12,18H2,(H,30,31)
Reactome pathway
n/an/an/an/a 75n/an/an/an/a
Argenta Discovery Ltd.
Curated by ChEMBL
Assay Description
Inhibition of CHK1 in human HT29 cells assessed as phosphorylation of histone H3 after 24 hrs by checkpoint abrogation cellular assay
J Med Chem 58: 5053-74 (2015)
Article DOI: 10.1021/acs.jmedchem.5b00464
BindingDB Entry DOI: 10.7270/Q2HD7XC5
Serine/threonine-protein kinase Chk1
(Homo sapiens (Human))
BDBM50091287
(CHEMBL3582228)
Show SMILES C(N1CCCCC1)c1ccc(cc1)-c1cnc2[nH]c3cnc(cc3c2c1)-c1cccnc1
Show InChI InChI=1S/C27H25N5/c1-2-11-32(12-3-1)18-19-6-8-20(9-7-19)22-13-24-23-14-25(21-5-4-10-28-15-21)29-17-26(23)31-27(24)30-16-22/h4-10,13-17H,1-3,11-12,18H2,(H,30,31)
Reactome pathway
n/an/a 0.950n/an/an/an/an/an/a
Argenta Discovery Ltd.
Curated by ChEMBL
Assay Description
Inhibition of human recombinant Chk1 using biotinylated AKT substrate after 30 mins by Alphascreen biochemical assay
J Med Chem 58: 5053-74 (2015)
Article DOI: 10.1021/acs.jmedchem.5b00464
BindingDB Entry DOI: 10.7270/Q2HD7XC5