BDBM50091292 CHEMBL3582202
SMILES: C[C@H]1CCC[C@@H](C)N1Cc1ccc(cc1)-c1cnc2[nH]c3cnc(cc3c2c1)C#N
InChI Key:
Data: 2 IC50  1 EC50
Activity Spreadsheet -- Enzyme Inhibition Constant Data from BindingDB
Found 3 hits for monomerid = 50091292
Trg + Lig
Ki
nM
ΔG°
kcal/mole
IC50
nM
Kd
nM
EC50/IC50
nM
koff
s-1
kon
M-1s-1
pHTemp
°C
Serine/threonine-protein kinase Chk1
(Homo sapiens (Human))
BDBM50091292
(CHEMBL3582202)
Show SMILES C[C@H]1CCC[C@@H](C)N1Cc1ccc(cc1)-c1cnc2[nH]c3cnc(cc3c2c1)C#N |r|
Reactome pathway
n/an/a 2.10n/an/an/an/an/an/a
Argenta Discovery Ltd.
Curated by ChEMBL
Assay Description
Inhibition of human recombinant Chk1 using biotinylated AKT substrate after 30 mins by Alphascreen biochemical assay
J Med Chem 58: 5053-74 (2015)
Article DOI: 10.1021/acs.jmedchem.5b00464
BindingDB Entry DOI: 10.7270/Q2HD7XC5
Serine/threonine-protein kinase Chk1
(Homo sapiens (Human))
BDBM50091292
(CHEMBL3582202)
Show SMILES C[C@H]1CCC[C@@H](C)N1Cc1ccc(cc1)-c1cnc2[nH]c3cnc(cc3c2c1)C#N |r|
Reactome pathway
n/an/an/an/a 99n/an/an/an/a
Argenta Discovery Ltd.
Curated by ChEMBL
Assay Description
Inhibition of CHK1 in human HT29 cells assessed as phosphorylation of histone H3 after 24 hrs by checkpoint abrogation cellular assay
J Med Chem 58: 5053-74 (2015)
Article DOI: 10.1021/acs.jmedchem.5b00464
BindingDB Entry DOI: 10.7270/Q2HD7XC5
Acetylcholinesterase
(Homo sapiens (Human))
BDBM50091292
(CHEMBL3582202)
Show SMILES C[C@H]1CCC[C@@H](C)N1Cc1ccc(cc1)-c1cnc2[nH]c3cnc(cc3c2c1)C#N |r|
NCI pathway
Reactome pathway
n/an/a 135n/an/an/an/an/an/a
Argenta Discovery Ltd.
Curated by ChEMBL
Assay Description
Inhibition of human acetylcholine esterase by horseradish peroxidase-coupled fluorescence assay
J Med Chem 58: 5053-74 (2015)
Article DOI: 10.1021/acs.jmedchem.5b00464
BindingDB Entry DOI: 10.7270/Q2HD7XC5