BDBM50091294 CHEMBL3582200
SMILES: CN1CCN(CC1)c1cccc(c1)-c1cnc2[nH]c3cnc(cc3c2c1)C#N
InChI Key: InChIKey=DKBADOYJGAGSRI-UHFFFAOYSA-N
Data: 2 IC50  1 EC50
Activity Spreadsheet -- Enzyme Inhibition Constant Data from BindingDB
Found 3 hits for monomerid = 50091294
Trg + Lig
Ki
nM
ΔG°
kcal/mole
IC50
nM
Kd
nM
EC50/IC50
nM
koff
s-1
kon
M-1s-1
pHTemp
°C
Serine/threonine-protein kinase Chk1
(Homo sapiens (Human))
BDBM50091294
(CHEMBL3582200)
Show SMILES CN1CCN(CC1)c1cccc(c1)-c1cnc2[nH]c3cnc(cc3c2c1)C#N
Show InChI InChI=1S/C22H20N6/c1-27-5-7-28(8-6-27)18-4-2-3-15(9-18)16-10-20-19-11-17(12-23)24-14-21(19)26-22(20)25-13-16/h2-4,9-11,13-14H,5-8H2,1H3,(H,25,26)
Reactome pathway
n/an/a 1.90n/an/an/an/an/an/a
Argenta Discovery Ltd.
Curated by ChEMBL
Assay Description
Inhibition of human recombinant Chk1 using biotinylated AKT substrate after 30 mins by Alphascreen biochemical assay
J Med Chem 58: 5053-74 (2015)
Article DOI: 10.1021/acs.jmedchem.5b00464
BindingDB Entry DOI: 10.7270/Q2HD7XC5
Serine/threonine-protein kinase Chk1
(Homo sapiens (Human))
BDBM50091294
(CHEMBL3582200)
Show SMILES CN1CCN(CC1)c1cccc(c1)-c1cnc2[nH]c3cnc(cc3c2c1)C#N
Show InChI InChI=1S/C22H20N6/c1-27-5-7-28(8-6-27)18-4-2-3-15(9-18)16-10-20-19-11-17(12-23)24-14-21(19)26-22(20)25-13-16/h2-4,9-11,13-14H,5-8H2,1H3,(H,25,26)
Reactome pathway
n/an/an/an/a 133n/an/an/an/a
Argenta Discovery Ltd.
Curated by ChEMBL
Assay Description
Inhibition of CHK1 in human HT29 cells assessed as phosphorylation of histone H3 after 24 hrs by checkpoint abrogation cellular assay
J Med Chem 58: 5053-74 (2015)
Article DOI: 10.1021/acs.jmedchem.5b00464
BindingDB Entry DOI: 10.7270/Q2HD7XC5
Acetylcholinesterase
(Homo sapiens (Human))
BDBM50091294
(CHEMBL3582200)
Show SMILES CN1CCN(CC1)c1cccc(c1)-c1cnc2[nH]c3cnc(cc3c2c1)C#N
Show InChI InChI=1S/C22H20N6/c1-27-5-7-28(8-6-27)18-4-2-3-15(9-18)16-10-20-19-11-17(12-23)24-14-21(19)26-22(20)25-13-16/h2-4,9-11,13-14H,5-8H2,1H3,(H,25,26)
NCI pathway
Reactome pathway
n/an/a 4.77E+3n/an/an/an/an/an/a
Argenta Discovery Ltd.
Curated by ChEMBL
Assay Description
Inhibition of human acetylcholine esterase by horseradish peroxidase-coupled fluorescence assay
J Med Chem 58: 5053-74 (2015)
Article DOI: 10.1021/acs.jmedchem.5b00464
BindingDB Entry DOI: 10.7270/Q2HD7XC5