BDBM50091313 CHEMBL3582214
SMILES: N#Cc1cc2c(cn1)[nH]c1ncc(cc21)-c1nc(CN2CCCCC2)cs1
InChI Key: InChIKey=FKFWKGGBTFGKFN-DKYXIQLCSA-N
Data: 2 IC50  1 EC50
Activity Spreadsheet -- Enzyme Inhibition Constant Data from BindingDB
Found 3 hits for monomerid = 50091313
Trg + Lig
Ki
nM
ΔG°
kcal/mole
IC50
nM
Kd
nM
EC50/IC50
nM
koff
s-1
kon
M-1s-1
pHTemp
°C
Serine/threonine-protein kinase Chk1
(Homo sapiens (Human))
BDBM50091313
(CHEMBL3582214)
Show SMILES N#Cc1cc2c(cn1)[nH]c1ncc(cc21)-c1nc(CN2CCCCC2)cs1
Show InChI InChI=1S/C17H23NO3/c1-10-4-6-11(7-5-10)13-8-12-9-14(19)16(18(12)2)15(13)17(20)21-3/h4-7,12-16,19H,8-9H2,1-3H3/t12-,13+,14?,15?,16?/m0/s1
Reactome pathway
n/an/a 14n/an/an/an/an/an/a
Argenta Discovery Ltd.
Curated by ChEMBL
Assay Description
Inhibition of human recombinant Chk1 using biotinylated AKT substrate after 30 mins by Alphascreen biochemical assay
J Med Chem 58: 5053-74 (2015)
Article DOI: 10.1021/acs.jmedchem.5b00464
BindingDB Entry DOI: 10.7270/Q2HD7XC5
Serine/threonine-protein kinase Chk1
(Homo sapiens (Human))
BDBM50091313
(CHEMBL3582214)
Show SMILES N#Cc1cc2c(cn1)[nH]c1ncc(cc21)-c1nc(CN2CCCCC2)cs1
Show InChI InChI=1S/C17H23NO3/c1-10-4-6-11(7-5-10)13-8-12-9-14(19)16(18(12)2)15(13)17(20)21-3/h4-7,12-16,19H,8-9H2,1-3H3/t12-,13+,14?,15?,16?/m0/s1
Reactome pathway
n/an/an/an/a 658n/an/an/an/a
Argenta Discovery Ltd.
Curated by ChEMBL
Assay Description
Inhibition of CHK1 in human HT29 cells assessed as phosphorylation of histone H3 after 24 hrs by checkpoint abrogation cellular assay
J Med Chem 58: 5053-74 (2015)
Article DOI: 10.1021/acs.jmedchem.5b00464
BindingDB Entry DOI: 10.7270/Q2HD7XC5
Acetylcholinesterase
(Homo sapiens (Human))
BDBM50091313
(CHEMBL3582214)
Show SMILES N#Cc1cc2c(cn1)[nH]c1ncc(cc21)-c1nc(CN2CCCCC2)cs1
Show InChI InChI=1S/C17H23NO3/c1-10-4-6-11(7-5-10)13-8-12-9-14(19)16(18(12)2)15(13)17(20)21-3/h4-7,12-16,19H,8-9H2,1-3H3/t12-,13+,14?,15?,16?/m0/s1
NCI pathway
Reactome pathway
n/an/a 18n/an/an/an/an/an/a
Argenta Discovery Ltd.
Curated by ChEMBL
Assay Description
Inhibition of human acetylcholine esterase by horseradish peroxidase-coupled fluorescence assay
J Med Chem 58: 5053-74 (2015)
Article DOI: 10.1021/acs.jmedchem.5b00464
BindingDB Entry DOI: 10.7270/Q2HD7XC5