BDBM50091811 6-Butyl-4-methyl-pyridin-2-ylamine::CHEMBL292507
SMILES: CCCCc1cc(C)cc(N)n1
InChI Key: InChIKey=VXEVTWMFMKSFLP-UHFFFAOYSA-N
Data: 1 IC50
Activity Spreadsheet -- Enzyme Inhibition Constant Data from BindingDB
Found 1 hit for monomerid = 50091811
Trg + Lig
Ki
nM
ΔG°
kcal/mole
IC50
nM
Kd
nM
EC50/IC50
nM
koff
s-1
kon
M-1s-1
pHTemp
°C
Nitric oxide synthase, inducible
(Homo sapiens (Human))
BDBM50091811
(6-Butyl-4-methyl-pyridin-2-ylamine | CHEMBL292507)
Show SMILES CCCCc1cc(C)cc(N)n1
Show InChI InChI=1S/C10H16N2/c1-3-4-5-9-6-8(2)7-10(11)12-9/h6-7H,3-5H2,1-2H3,(H2,11,12)
NCI pathway
Reactome pathway
n/an/a 46n/an/an/an/an/an/a
Merck Research Laboratories Rahway
Curated by ChEMBL
Assay Description
Inhibitory activity against inducible nitric oxide synthase (iNOS)
Bioorg Med Chem Lett 10: 1975-8 (2001)
BindingDB Entry DOI: 10.7270/Q2319V30